{"text_format":"1","workbook":"xlsx","n_sheets":3,"sheets":["Orden de Pago","BD Orden Pago","Parametros"],"not_rendered":{"charts":0,"images":1,"macros":1,"external_links":0,"defined_names":21,"comments":0,"pivot_tables":0},"unopened":[],"bounds":{"document_bytes":16777216,"sheet_cells":100000,"rows_first":2000,"rows_last":500,"rows_between":2000,"halvings":0,"cell_chars":16384,"cell_head_chars":4096},"cells_cut":0,"cells_raw":0,"read":"whole","date_system":"1900"}

{"sheet":"Orden de Pago","index":0,"n_rows":43,"n_cols":17,"rows_kept":43,"cut":false,"hidden":false,"merged":[[41,0,41,1],[42,0,42,5],[6,4,6,5],[8,4,8,5],[30,2,30,3],[24,2,24,3],[22,0,22,1],[15,0,15,3],[35,2,35,3],[37,0,37,5],[33,4,35,5],[28,2,28,3],[29,2,29,3],[31,2,31,3],[22,2,22,5],[25,2,25,3],[0,1,1,3],[9,0,9,2],[8,0,8,2],[11,0,11,3],[11,4,11,5],[2,0,4,0],[6,0,6,2],[5,4,5,5],[2,1,4,7],[34,2,34,3],[33,2,33,3],[26,2,26,3],[32,2,32,3],[27,2,27,3],[23,2,23,3],[18,0,18,5],[19,0,19,5],[9,4,9,5],[12,0,14,3],[21,0,21,5],[17,0,17,3]]}
[null,{"$f":"IF(ISERROR(VLOOKUP($E$6,'BD Orden Pago'!$A$5:$K$5001,4,FALSE)),\"ORDEN DE PAGO NO EXISTE\",\"\")","v":"ORDEN DE PAGO NO EXISTE"},null,null,null,null,null,null,"Porcentaje IVA",{"$f":"VLOOKUP($E$6,'BD Orden Pago'!$A$5:$K$5001,13,FALSE)","v":{"$error":"#N/A"}},null,null,null,null,null,"mavdt","MINISTERIO DE AMBIENTE, VIVIENDA Y DESARROLLO TERRITORIAL"]
[null,null,null,null,null,null,null,null,null,null,null,null,null,null,null,"fonam","FONDO NACIONAL AMBIENTAL - FONAM"]
[null,"FORMATO:  ORDEN DE TRANSFERENCIA DE FONDOS\nPROCESO: GESTIÓN FINANCIERA\nVersión: 9.0 Fecha: 19/05/2025 Código: FRA-F-04                                                                                                                                                                             ",null,null,null,null,null,null,"Inversión",{"$f":"VLOOKUP($E$6,'BD Orden Pago'!$A$5:$K$5001,15,FALSE)","v":{"$error":"#N/A"}}]
[null,null,null,null,null,null,null,null,"Inversión FONVIVIENDA",{"$f":"VLOOKUP($E$6,'BD Orden Pago'!$A$5:$K$5001,16,FALSE)","v":{"$error":"#N/A"}}]
[null,null,null,null,null,null,null,null,"mu",{"$f":"VLOOKUP($E$6,'BD Orden Pago'!$A$5:$K$5001,21,FALSE)","v":{"$error":"#N/A"}},null,null,null,null,null,{"$f":"VLOOKUP(E6,'BD Orden Pago'!$A$5:$P$5001,14,FALSE)","v":{"$error":"#N/A"}}]
[]
[{"$f":"\"Dependencia : \"\"SUBDIRECCION DE  FINANZAS Y PRESUPUESTO\"","v":"Dependencia : \"SUBDIRECCION DE  FINANZAS Y PRESUPUESTO"},null,null,"Fecha:"]
[]
[{"$f":"\"Beneficiario: \"&VLOOKUP($E$6,'BD Orden Pago'!$A$5:$K$5001,6,FALSE)","v":{"$error":"#N/A"}},null,null,"C.C. o NIT",{"$f":"VLOOKUP($E$6,'BD Orden Pago'!$A$5:$K$5001,5,FALSE)","v":{"$error":"#N/A"}}]
[{"$f":"\"Dirección: \"&VLOOKUP($E$6,'BD Orden Pago'!$A$5:$K$5001,9,FALSE)","v":{"$error":"#N/A"}},null,null,"Teléfono: ",{"$f":"VLOOKUP($E$6,'BD Orden Pago'!$A$5:$K$5001,10,FALSE)","v":{"$error":"#N/A"}}]
[]
["DESCRIPCIÓN",null,null,null,"VALORES ($)"]
[{"$f":"UPPER(VLOOKUP($E$6,'BD Orden Pago'!$A$5:$K$5001,7,FALSE))","v":{"$error":"#N/A"}}]
[]
[null,null,null,null,{"$f":"VLOOKUP($E$6,'BD Orden Pago'!$A$5:$K$5001,8,FALSE)","v":{"$error":"#N/A"}}]
[]
[]
["Valor a Transferir",null,null,null,{"$f":"SUM(E13:E16)","v":{"$error":"#N/A"}}]
[{"$f":"Num2Text(ValorPago)&CENTAVOS(ValorPago)","v":{"$error":"#VALUE!"}}]
[]
[]
["IMPUTACION CONTABLE"]
[]
["COMP MAYOR   SUBCT    AUX          DETALLE",null,"VALOR"]
[]
[]
[]
[]
[]
[]
[]
[]
[]
[null,null,null,null,"SUBDIRECTOR DE FINANZAS Y PRESUPUESTO"]
[]
[]
[]
["TESORERÍA"]
["BANCO",null,"RECIBÍ:"]
["CHEQUE"]
["FECHA",null,"C.C. / NIT"]
["TESORERO"]
["En cumplimiento de la Ley 1581 de 2012 y el Decreto 1377 de 2013 y las demás normas que los modifiquen, adicionen o complementen, le informamos que usted puede conocer la Política de Tratamiento de los Datos Personales del Ministerio de Vivienda, Ciudad y Territorio, a través del siguiente link:   https://www.minvivienda.gov.co/sites/default/files/procesos/0783_2021.pdf"]

{"sheet":"BD Orden Pago","index":1,"n_rows":5044,"n_cols":100,"rows_kept":5044,"cut":false,"hidden":false,"merged":[]}
[]
[null,null,null,null,{"$f":"TODAY()","v":"2025-05-19"}]
[1,2,3,4,5,6,7,8,9,10,11,12,13,14,15,16,17,18,19,20,21,22]
["Orden_de_Transferencia","Tipo_Transferencia","FechaTransferencia","Dependencia","Nit_Benficiarios","Nombre_beneficiario","Concepto","Valor_Factura","Dirección","Telefono","Banco","Cheque","Fecha Giro","Entidad"]
[5]
[6]
[]
[]
[]
[]
[]
[]
[]
[]
[]
[]
[]
[]
[]
[]
[]
[]
[]
[]
[]
[]
[]
[]
[]
[]
[]
[]
[]
[]
[]
[]
[]
[]
[]
[]
[]
[]
[]
[]
[]
[]
[]
[]
[]
[]
[]
[]
[]
[]
[]
[]
[]
[]
[]
[]
[]
[]
[]
[]
[]
[]
[]
[]
[]
[]
[]
[]
[]
[]
[]
[]
[]
[]
[]
[]
[]
[]
[]
[]
[]
[]
[]
[]
[]
[]
[]
[]
[]
[]
[]
[]
[]
[]
[]
[]
[]
[]
[]
[]
[]
[]
[]
[]
[]
[]
[]
[]
[]
[]
[]
[]
[]
[]
[]
[]
[]
[]
[]
[]
[]
[]
[]
[]
[]
[]
[]
[]
[]
[]
[]
[]
[]
[]
[]
[]
[]
[]
[]
[]
[]
[]
[]
[]
[]
[]
[]
[]
[]
[]
[]
[]
[]
[]
[]
[]
[]
[]
[]
[]
[]
[]
[]
[]
[]
[]
[]
[]
[]
[]
[]
[]
[]
[]
[]
[]
[]
[]
[]
[]
[]
[]
[]
[]
[]
[]
[]
[]
[]
[]
[]
[]
[]
[]
[]
[]
[]
[]
[]
[]
[]
[]
[]
[]
[]
[]
[]
[]
[]
[]
[]
[]
[]
[]
[]
[]
[]
[]
[]
[]
[]
[]
[]
[]
[]
[]
[]
[]
[]
[]
[]
[]
[]
[]
[]
[]
[]
[]
[]
[]
[]
[]
[]
[]
[]
[]
[]
[]
[]
[]
[]
[]
[]
[]
[]
[]
[]
[]
[]
[]
[]
[]
[]
[]
[]
[]
[]
[]
[]
[]
[]
[]
[]
[]
[]
[]
[]
[]
[]
[]
[]
[]
[]
[]
[]
[]
[]
[]
[]
[]
[]
[]
[]
[]
[]
[]
[]
[]
[]
[]
[]
[]
[]
[]
[]
[]
[]
[]
[]
[]
[]
[]
[]
[]
[]
[]
[]
[]
[]
[]
[]
[]
[]
[]
[]
[]
[]
[]
[]
[]
[]
[]
[]
[]
[]
[]
[]
[]
[]
[]
[]
[]
[]
[]
[]
[]
[]
[]
[]
[]
[]
[]
[]
[]
[]
[]
[]
[]
[]
[]
[]
[]
[]
[]
[]
[]
[]
[]
[]
[]
[]
[]
[]
[]
[]
[]
[]
[]
[]
[]
[]
[]
[]
[]
[]
[]
[]
[]
[]
[]
[]
[]
[]
[]
[]
[]
{"$rows_left_out":4645}
{"sheet":"Parametros","index":2,"n_rows":5071,"n_cols":2,"rows_kept":5071,"cut":false,"hidden":false,"merged":[]}
[]
[]
[]
[]
[]
[]
[]
[]
[]
[]
[]
[]
[]
[]
[]
[]
[]
[]
[]
[]
[]
[]
[]
[]
[]
[]
[]
[]
[]
[]
[]
[]
[]
[]
[]
[]
[]
[]
[]
[]
[]
[]
[]
[]
[]
[]
[]
[]
[]
[]
[]
[]
[]
[]
[]
[]
[]
[]
[]
[]
[]
[]
[]
[]
[]
[]
[]
[]
[]
[]
[]
[]
[]
[]
[]
[]
[]
[]
[]
[]
[]
[]
[]
[]
[]
[]
[]
[]
[]
[]
[]
[]
[]
[]
[]
[]
[]
[]
[]
[]
[]
[]
[]
[]
[]
[]
[]
[]
[]
[]
[]
[]
[]
[]
[]
[]
[]
[]
[]
[]
[]
[]
[]
[]
[]
[]
[]
[]
[]
[]
[]
[]
[]
[]
[]
[]
[]
[]
[]
[]
[]
[]
[]
[]
[]
[]
[]
[]
[]
[]
[]
[]
[]
[]
[]
[]
[]
[]
[]
[]
[]
[]
[]
[]
[]
[]
[]
[]
[]
[]
[]
[]
[]
[]
[]
[]
[]
[]
[]
[]
[]
[]
[]
[]
[]
[]
[]
[]
[]
[]
[]
[]
[]
[]
[]
[]
[]
[]
[]
[]
[]
[]
[]
[]
[]
[]
[]
[]
[]
[]
[]
[]
[]
[]
[]
[]
[]
[]
[]
[]
[]
[]
[]
[]
[]
[]
[]
[]
[]
[]
[]
[]
[]
[]
[]
[]
[]
[]
[]
[]
[]
[]
[]
[]
[]
[]
[]
[]
[]
[]
[]
[]
[]
[]
[]
[]
[]
[]
[]
[]
[]
[]
[]
[]
[]
[]
[]
[]
[]
[]
[]
[]
[]
[]
[]
[]
[]
[]
[]
[]
[]
[]
[]
[]
[]
[]
[]
[]
[]
[]
[]
[]
[]
[]
[]
[]
[]
[]
[]
[]
[]
[]
[]
[]
[]
[]
[]
[]
[]
[]
[]
[]
[]
[]
[]
[]
[]
[]
[]
[]
[]
[]
[]
[]
[]
[]
[]
[]
[]
[]
[]
[]
[]
[]
[]
[]
[]
[]
[]
[]
[]
[]
[]
[]
[]
[]
[]
[]
[]
[]
[]
[]
[]
[]
[]
[]
[]
[]
[]
[]
[]
[]
[]
[]
[]
[]
[]
[]
[]
[]
[]
[]
[]
[]
[]
[]
[]
[]
[]
[]
[]
[]
[]
[]
[]
[]
[]
[]
[]
[]
[]
[]
[]
[]
[]
[]
[]
[]
[]
[]
{"$rows_left_out":4671}