{"text_format":"1","workbook":"xlsx","n_sheets":15,"sheets":["Ele_Dep_MVCT","PEI_AJUSTE_PND","PEI_AJUSTE_Gestión","PEI_MVCT_NUEVO","ListasPactos","Indicadores PEI","PEI-PRELIMINAR","Resumen PEI","FORMATO PAI","Listas","PEI2021","Base Procesos y Riesgos","Proyecto","PAI-PRELIMINAR","FIN"],"not_rendered":{"charts":2,"images":25,"macros":1,"external_links":3,"defined_names":194,"comments":0,"pivot_tables":0},"unopened":[],"bounds":{"document_bytes":16777216,"sheet_cells":100000,"rows_first":2000,"rows_last":500,"rows_between":2000,"halvings":0,"cell_chars":16384,"cell_head_chars":4096},"cells_cut":0,"cells_raw":0,"read":"whole","date_system":"1900"}

{"sheet":"Ele_Dep_MVCT","index":0,"n_rows":14,"n_cols":13,"rows_kept":14,"cut":false,"hidden":false,"merged":[[13,3,13,12],[25,2,25,13],[1,1,9,3],[1,4,9,11],[11,1,11,3],[11,4,11,11],[11,12,11,14],[1,12,9,14]]}
[]
[null,"LOGO",null,null,"FORMATO Captura de información para la Planeación Institucional\nPROCESO: Direccionamiento Estratégico\nVersión 3.0, Fecha: 23/11/2023, DET-F-22"]
[]
[]
[]
[]
[]
[]
[]
[]
[]
[null,"Elija su dependencia",null,null,null,null,null,null,null,null,null,null,{"$f":"MID(E12,1,FIND(\"-\",E12,1)-1)","v":{"$error":"#VALUE!"}}]
[]
[null,null,null,"Elija el instrumento de planeación a formular:"]

{"sheet":"PEI_AJUSTE_PND","index":1,"n_rows":81,"n_cols":18,"rows_kept":81,"cut":false,"hidden":false,"merged":[[1,8,4,9],[1,4,4,7],[59,2,59,8],[67,2,67,3],[67,4,67,8],[62,2,62,3],[62,4,62,8],[1,1,4,3],[6,2,6,8],[7,2,7,8],[58,2,58,3],[58,4,58,8],[32,2,32,8],[31,2,31,3],[31,4,31,8],[25,2,25,3],[68,2,68,8],[69,2,69,3],[69,5,69,8],[63,2,63,8],[64,2,65,3],[66,2,66,8],[5,2,5,9],[35,2,35,8],[36,2,36,3],[36,4,36,8],[42,4,42,8],[8,2,8,3],[8,4,8,8],[10,2,10,3],[10,4,10,8],[38,2,38,3],[38,4,38,8],[24,2,24,8],[29,2,29,3],[29,4,29,8],[30,2,30,8],[33,2,33,3],[33,4,33,8],[25,4,25,8],[26,2,26,8],[27,2,27,3],[27,4,27,8],[28,2,28,8],[51,2,51,8],[50,2,50,3],[50,4,50,8],[39,2,39,8],[40,2,40,3],[40,4,40,8],[44,2,44,3],[44,4,44,8],[49,2,49,8],[45,2,45,8],[46,2,46,3],[46,4,46,8],[47,2,47,8],[48,2,48,3],[48,4,48,8],[41,2,41,8],[11,2,11,8],[12,2,12,8],[13,2,13,3],[13,4,13,8],[14,2,14,8],[15,2,15,3],[15,4,15,8],[16,2,16,8],[17,2,17,3],[17,4,17,8],[23,2,23,8],[18,2,18,8],[19,2,19,8],[20,2,20,3],[20,4,20,8],[21,2,21,8],[22,2,22,3],[22,4,22,8],[56,2,56,3],[56,4,56,8],[61,2,61,8],[34,2,34,8],[37,2,37,8],[55,2,55,8],[60,2,60,3],[60,4,60,8],[57,2,57,8],[43,2,43,8],[54,2,54,3],[54,4,54,8],[53,2,53,8],[52,2,52,3],[52,4,52,8],[42,2,42,3]]}
[]
[null,null,null,null,"FORMATO Captura de información para la Planeación Institucional\nPROCESO: Direccionamiento Estratégico"]
[]
[]
[null,null,null,null,null,null,null,null,null,null,null,null,null,null,null,null,"Acción:",{"$f":"\"Pind\"&Ele_Dep_MVCT!M12","v":{"$error":"#VALUE!"}}]
[]
[]
[null,null,{"$f":"IF(Ele_Dep_MVCT!E12=\"\",\"Elegir una dependencia, oprimir el botón de la derecha Elegir Instrumento (PEI-PAI)\",\"Actualización de indicador de PND ya incluidos en el PEI\")","v":"Elegir una dependencia, oprimir el botón de la derecha Elegir Instrumento (PEI-PAI)"}]
[{"$f":"Ele_Dep_MVCT!E12","v":0},null,"Elija una opción"]
[]
[null,null,{"$f":"IF(E9=\"Eliminación\",\"Justificación de la eliminación\",\"Observaciones\")","v":"Observaciones"}]
[]
[null,null,"Plan Nacional de Desarrollo",null,null,null,null,null,null,null,null,null,null,null,null,{"$f":"\"P\"&(MID(E14,1,FIND(\".\",E14,1)-1))","v":{"$error":"#VALUE!"}}]
[{"$f":"IFERROR((VLOOKUP(E37,'PEI2021'!$A$6:$AAG$130,5,FALSE)),\"Pacto.\")","v":"Pacto."},null,"Pactos relacionados",null,null,null,null,null,null,null,null,null,null,null,null,{"$f":"P13&\"L\"&(MID(E16,1,FIND(\".\",E16,1)-1))","v":{"$error":"#VALUE!"}}]
[]
[{"$f":"IFERROR((VLOOKUP(E37,'PEI2021'!$A$6:$AAG$130,6,FALSE)),\"L.\")","v":"L."},null,"Línea"]
[]
[{"$f":"VLOOKUP(E37,'PEI2021'!$A$6:$AAG$130,7,FALSE)","v":{"$error":"#N/A"}},null,"Objetivo"]
[null,null,"Objetivos de Desarrollo Sostenible"]
[]
[{"$f":"VLOOKUP(E37,'PEI2021'!$A$6:$AD$130,8,FALSE)","v":{"$error":"#N/A"}},null,"Principal "]
[]
[{"$f":"IF(VLOOKUP(E37,'PEI2021'!$A$6:$AD$130,9,FALSE)=\"\",\"\",VLOOKUP(E37,'PEI2021'!$A$6:$AD$130,9,FALSE))","v":{"$error":"#N/A"}},null,"Secundario"]
[]
[null,null,"Información General"]
[{"$f":"VLOOKUP(E37,'PEI2021'!$A$6:$AD$130,2,FALSE)","v":{"$error":"#N/A"}},null,"Dimensión Estratégica"]
[]
[{"$f":"VLOOKUP(E37,'PEI2021'!$A$6:$AD$130,3,FALSE)","v":{"$error":"#N/A"}},null,"Objetivo Estratégico  Sector"]
[]
[{"$f":"VLOOKUP(E37,'PEI2021'!$A$6:$AD$130,4,FALSE)","v":{"$error":"#N/A"}},null,"Objetivos estratégicos la entidad"]
[]
[{"$f":"VLOOKUP(E37,'PEI2021'!$A$6:$AD$130,10,FALSE)","v":{"$error":"#N/A"}},null,"Dimensión MIPG"]
[]
[{"$f":"VLOOKUP(E37,'PEI2021'!$A$6:$AD$130,11,FALSE)","v":{"$error":"#N/A"}},null,"Proceso SIG"]
[]
[null,null,"Hoja de vida del Indicador"]
["OJO",null,"Nombre del indicador"]
[]
[{"$f":"VLOOKUP(E37,'PEI2021'!$A$6:$AD$130,14,FALSE)","v":{"$error":"#N/A"}},null,"Objetivo del indicador"]
[]
[{"$f":"VLOOKUP(E37,'PEI2021'!$A$6:$AD$130,13,FALSE)","v":{"$error":"#N/A"}},null,"Fórmula del indicador"]
[]
[{"$f":"VLOOKUP(E37,'PEI2021'!$A$6:$AD$130,15,FALSE)","v":{"$error":"#N/A"}},null,"Definición de las variable 1 de la fórmula"]
[]
[{"$f":"IF(VLOOKUP(E37,'PEI2021'!$A$6:$AD$130,16,FALSE)=\"\",\"NA\",(VLOOKUP(E37,'PEI2021'!$A$6:$AD$130,16,FALSE)))","v":{"$error":"#N/A"}},null,"Definición de las variable 2 de la fórmula"]
[]
["NA",null,"Definición de las variable 3 de la fórmula"]
[]
["NA",null,"Definición de las variable 4 de la fórmula"]
[]
[{"$f":"IF(VLOOKUP(E37,'PEI2021'!$A$6:$AD$130,22,FALSE)=\"\",\"NA\",(VLOOKUP(E37,'PEI2021'!$A$6:$AD$130,22,FALSE)))","v":{"$error":"#N/A"}},null,"Tipología",null,null,null,null,null,null,null,"SI"]
[]
[{"$f":"IF(VLOOKUP(E37,'PEI2021'!$A$6:$AD$130,23,FALSE)=\"\",\"NA\",(VLOOKUP(E37,'PEI2021'!$A$6:$AD$130,23,FALSE)))","v":{"$error":"#N/A"}},null,"Unidad de medida"]
[]
[{"$f":"IF(VLOOKUP(E37,'PEI2021'!$A$6:$AD$130,19,FALSE)=\"\",\"NA\",(VLOOKUP(E37,'PEI2021'!$A$6:$AD$130,19,FALSE)))","v":{"$error":"#N/A"}},null,"Fuente de información"]
[]
[{"$f":"IF(VLOOKUP(E37,'PEI2021'!$A$6:$AD$130,21,FALSE)=\"\",\"NA\",(VLOOKUP(E37,'PEI2021'!$A$6:$AD$130,21,FALSE)))","v":{"$error":"#N/A"}},null,"Periodicidad",null,null,null,null,null,null,null,"SI"]
[]
[{"$f":"IF(VLOOKUP(E37,'PEI2021'!$A$6:$AD$130,20,FALSE)=\"\",\"NA\",(VLOOKUP(E37,'PEI2021'!$A$6:$AD$130,20,FALSE)))","v":{"$error":"#N/A"}},null,"Días de rezago"]
[]
[{"$f":"IF(VLOOKUP(E37,'PEI2021'!$A$6:$AD$130,24,FALSE)=\"\",\"NA\",(VLOOKUP(E37,'PEI2021'!$A$6:$AD$130,24,FALSE)))","v":{"$error":"#N/A"}},null,"Línea Base",null,null,null,null,null,null,null,"SI"]
[]
[{"$f":"IF(VLOOKUP(E37,'PEI2021'!$A$6:$AD$130,18,FALSE)=\"\",\"NA\",(VLOOKUP(E37,'PEI2021'!$A$6:$AD$130,18,FALSE)))","v":{"$error":"#N/A"}},null,"Fecha de la línea base",null,null,null,null,null,null,null,"SI"]
[]
[null,null,"METAS",null,2019,2020,2021,2022,"Cuatrienio"]
[]
[]
[{"$f":"IF(VLOOKUP(E37,'PEI2021'!$A$6:$AD$130,17,FALSE)=\"\",\"NA\",(VLOOKUP(E37,'PEI2021'!$A$6:$AD$130,17,FALSE)))","v":{"$error":"#N/A"}},null,"Tendencia"]
[]
[null,null,"Seguimiento ",null,"MENSUAL","Por parte de la Oficina Asesora de Planeación"]
[]
[]
[]
[]
[null,null,null,null,2019,2020,2021,2022,"Cuatrienio"]
[null,null,null,null,{"$f":"IF(VLOOKUP(E37,'PEI2021'!$A$6:$AD$130,25,FALSE)=\"\",\"NA\",(VLOOKUP(E37,'PEI2021'!$A$6:$AD$130,25,FALSE)))","v":{"$error":"#N/A"}},{"$f":"IF(VLOOKUP(E37,'PEI2021'!$A$6:$AD$130,26,FALSE)=\"\",\"NA\",(VLOOKUP(E37,'PEI2021'!$A$6:$AD$130,26,FALSE)))","v":{"$error":"#N/A"}},{"$f":"IF(VLOOKUP(E37,'PEI2021'!$A$6:$AD$130,27,FALSE)=\"\",\"NA\",(VLOOKUP(E37,'PEI2021'!$A$6:$AD$130,27,FALSE)))","v":{"$error":"#N/A"}},{"$f":"IF(VLOOKUP(E37,'PEI2021'!$A$6:$AD$130,28,FALSE)=\"\",\"NA\",(VLOOKUP(E37,'PEI2021'!$A$6:$AD$130,28,FALSE)))","v":{"$error":"#N/A"}},{"$f":"IF(VLOOKUP(E37,'PEI2021'!$A$6:$AD$130,29,FALSE)=\"\",\"NA\",(VLOOKUP(E37,'PEI2021'!$A$6:$AD$130,29,FALSE)))","v":{"$error":"#N/A"}}]
[]
[]
[]
[]
[null,null,null,null,"","","",""]

{"sheet":"PEI_AJUSTE_Gestión","index":2,"n_rows":81,"n_cols":19,"rows_kept":81,"cut":false,"hidden":false,"merged":[[1,8,4,9],[1,4,4,7],[9,2,9,8],[67,2,67,3],[67,4,67,8],[5,2,5,9],[1,1,4,3],[6,2,6,8],[7,2,7,8],[8,2,8,3],[8,4,8,8],[10,2,10,3],[10,4,10,8],[35,2,35,8],[36,2,36,3],[60,2,60,3],[36,4,36,8],[37,2,37,8],[50,2,50,3],[50,4,50,8],[41,2,41,8],[57,2,57,8],[56,2,56,3],[56,4,56,8],[43,2,43,8],[44,2,44,3],[44,4,44,8],[45,2,45,8],[46,2,46,3],[46,4,46,8],[47,2,47,8],[48,2,48,3],[48,4,48,8],[62,2,62,3],[62,4,62,8],[59,2,59,8],[40,2,40,3],[40,4,40,8],[49,2,49,8],[52,2,52,3],[52,4,52,8],[42,2,42,3],[42,4,42,8],[51,2,51,8],[54,2,54,3],[61,2,61,8],[54,4,54,8],[53,2,53,8],[55,2,55,8],[64,2,65,3],[24,2,24,8],[29,2,29,3],[29,4,29,8],[30,2,30,8],[33,2,33,3],[33,4,33,8],[32,2,32,8],[31,2,31,3],[31,4,31,8],[25,2,25,3],[25,4,25,8],[26,2,26,8],[27,2,27,3],[60,4,60,8],[34,2,34,8],[20,2,20,3],[20,4,20,8],[12,2,12,8],[13,2,13,3],[13,4,13,8],[14,2,14,8],[15,2,15,3],[15,4,15,8],[16,2,16,8],[17,2,17,3],[17,4,17,8],[18,2,18,8],[19,2,19,8],[21,2,21,8],[22,2,22,3],[22,4,22,8],[23,2,23,8],[69,2,69,3],[69,5,69,8],[68,2,68,8],[27,4,27,8],[28,2,28,8],[39,2,39,8],[38,2,38,3],[38,4,38,8],[58,2,58,3],[58,4,58,8],[63,2,63,8],[66,2,66,8]]}
[]
[null,null,null,null,"FORMATO Captura de información para la Planeación Institucional\nPROCESO: Direccionamiento Estratégico",null,null,null,null,null,{"$f":"+TODAY()","v":"2023-11-23"}]
[]
[]
[null,null,null,null,null,null,null,null,null,null,null,null,null,null,null,null,null,null,{"$f":"\"Gind\"&Ele_Dep_MVCT!M12","v":{"$error":"#VALUE!"}}]
[]
[]
[null,null,{"$f":"IF(Ele_Dep_MVCT!E12=\"\",\"Elegir una dependencia, oprimir el botón de la derecha Elegir Instrumento (PEI-PAI)\",\"Actualización de indicador de GESTIÓN ya incluidos en el PEI\")","v":"Elegir una dependencia, oprimir el botón de la derecha Elegir Instrumento (PEI-PAI)"}]
[{"$f":"Ele_Dep_MVCT!E12","v":0},null,"Elija una opción"]
[]
[null,null,{"$f":"IF(E9=\"Eliminación\",\"Justificación de la eliminación\",\"Observaciones\")","v":"Observaciones"}]
[]
[null,null,"Plan Nacional de Desarrollo",null,null,null,null,null,null,null,null,null,null,null,null,null,null,{"$f":"\"P\"&(MID(E14,1,FIND(\".\",E14,1)-1))","v":{"$error":"#VALUE!"}}]
[{"$f":"IFERROR((VLOOKUP(E37,'PEI2021'!$A$6:$AAG$130,5,FALSE)),\"Pacto.\")","v":"Pacto."},null,"Pactos relacionados",null,null,null,null,null,null,null,null,null,null,null,null,null,null,{"$f":"R13&\"L\"&(MID(E16,1,FIND(\".\",E16,1)-1))","v":{"$error":"#VALUE!"}}]
[]
[{"$f":"IFERROR((VLOOKUP(E37,'PEI2021'!$A$6:$AAG$130,6,FALSE)),\"L.\")","v":"L."},null,"Línea"]
[]
[{"$f":"VLOOKUP(E37,'PEI2021'!$A$6:$AAG$130,7,FALSE)","v":{"$error":"#N/A"}},null,"Objetivo"]
[null,null,"Objetivos de Desarrollo Sostenible"]
[]
[{"$f":"VLOOKUP(E37,'PEI2021'!$A$6:$AD$130,8,FALSE)","v":{"$error":"#N/A"}},null,"Principal "]
[]
[{"$f":"IF(VLOOKUP(E37,'PEI2021'!$A$6:$AD$130,9,FALSE)=\"\",\"\",VLOOKUP(E37,'PEI2021'!$A$6:$AD$130,9,FALSE))","v":{"$error":"#N/A"}},null,"Secundario"]
[]
[null,null,"Información General"]
[{"$f":"VLOOKUP(E37,'PEI2021'!$A$6:$AD$130,2,FALSE)","v":{"$error":"#N/A"}},null,"Dimensión Estratégica"]
[]
[{"$f":"VLOOKUP(E37,'PEI2021'!$A$6:$AD$130,3,FALSE)","v":{"$error":"#N/A"}},null,"Objetivo Estratégico  Sector"]
[]
[{"$f":"VLOOKUP(E37,'PEI2021'!$A$6:$AD$130,4,FALSE)","v":{"$error":"#N/A"}},null,"Objetivos estratégicos la entidad"]
[]
[{"$f":"VLOOKUP(E37,'PEI2021'!$A$6:$AD$130,10,FALSE)","v":{"$error":"#N/A"}},null,"Dimensión MIPG"]
[]
[{"$f":"VLOOKUP(E37,'PEI2021'!$A$6:$AD$130,11,FALSE)","v":{"$error":"#N/A"}},null,"Proceso SIG"]
[]
[null,null,"Hoja de vida del Indicador"]
["OJO",null,"Nombre del indicador"]
[]
[{"$f":"VLOOKUP(E37,'PEI2021'!$A$6:$AD$130,14,FALSE)","v":{"$error":"#N/A"}},null,"Objetivo del indicador"]
[]
[{"$f":"VLOOKUP(E37,'PEI2021'!$A$6:$AD$130,13,FALSE)","v":{"$error":"#N/A"}},null,"Fórmula"]
[]
[{"$f":"VLOOKUP(E37,'PEI2021'!$A$6:$AD$130,15,FALSE)","v":{"$error":"#N/A"}},null,"Definición de las variable 1 de la fórmula"]
[]
[{"$f":"IF(VLOOKUP(E37,'PEI2021'!$A$6:$AD$130,16,FALSE)=\"\",\"NA\",(VLOOKUP(E37,'PEI2021'!$A$6:$AD$130,16,FALSE)))","v":{"$error":"#N/A"}},null,"Definición de las variable 2 de la fórmula"]
[]
["NA",null,"Definición de las variable 3 de la fórmula"]
[]
["NA",null,"Definición de las variable 4 de la fórmula"]
[]
[{"$f":"IF(VLOOKUP(E37,'PEI2021'!$A$6:$AD$130,22,FALSE)=\"\",\"NA\",(VLOOKUP(E37,'PEI2021'!$A$6:$AD$130,22,FALSE)))","v":{"$error":"#N/A"}},null,"Tipología"]
[]
[{"$f":"IF(VLOOKUP(E37,'PEI2021'!$A$6:$AD$130,23,FALSE)=\"\",\"NA\",(VLOOKUP(E37,'PEI2021'!$A$6:$AD$130,23,FALSE)))","v":{"$error":"#N/A"}},null,"Unidad de medida"]
[]
[{"$f":"IF(VLOOKUP(E37,'PEI2021'!$A$6:$AD$130,19,FALSE)=\"\",\"NA\",(VLOOKUP(E37,'PEI2021'!$A$6:$AD$130,19,FALSE)))","v":{"$error":"#N/A"}},null,"Fuente de información"]
[]
[{"$f":"IF(VLOOKUP(E37,'PEI2021'!$A$6:$AD$130,21,FALSE)=\"\",\"NA\",(VLOOKUP(E37,'PEI2021'!$A$6:$AD$130,21,FALSE)))","v":{"$error":"#N/A"}},null,"Periodicidad"]
[]
[{"$f":"IF(VLOOKUP(E37,'PEI2021'!$A$6:$AD$130,20,FALSE)=\"\",\"NA\",(VLOOKUP(E37,'PEI2021'!$A$6:$AD$130,20,FALSE)))","v":{"$error":"#N/A"}},null,"Días de rezago"]
[]
[{"$f":"IF(VLOOKUP(E37,'PEI2021'!$A$6:$AD$130,24,FALSE)=\"\",\"NA\",(VLOOKUP(E37,'PEI2021'!$A$6:$AD$130,24,FALSE)))","v":{"$error":"#N/A"}},null,"Línea Base"]
[]
[{"$f":"IF(VLOOKUP(E37,'PEI2021'!$A$6:$AD$130,18,FALSE)=\"\",\"NA\",(VLOOKUP(E37,'PEI2021'!$A$6:$AD$130,18,FALSE)))","v":{"$error":"#N/A"}},null,"Fecha de la línea base"]
[]
[null,null,"METAS",null,2019,2020,2021,2022,"Cuatrienio"]
[]
[]
[{"$f":"IF(VLOOKUP(E37,'PEI2021'!$A$6:$AD$130,17,FALSE)=\"\",\"NA\",(VLOOKUP(E37,'PEI2021'!$A$6:$AD$130,17,FALSE)))","v":{"$error":"#N/A"}},null,"Tendencia"]
[]
[null,null,"Seguimiento ",null,"MENSUAL","Por parte de la Oficina Asesora de Planeación"]
[]
[]
[]
[]
[null,null,null,null,2019,2020,2021,2022,"Cuatrienio"]
[null,null,null,null,{"$f":"IF(VLOOKUP(E37,'PEI2021'!$A$6:$AD$130,25,FALSE)=\"\",\"NA\",(VLOOKUP(E37,'PEI2021'!$A$6:$AD$130,25,FALSE)))","v":{"$error":"#N/A"}},{"$f":"IF(VLOOKUP(E37,'PEI2021'!$A$6:$AD$130,26,FALSE)=\"\",\"NA\",(VLOOKUP(E37,'PEI2021'!$A$6:$AD$130,26,FALSE)))","v":{"$error":"#N/A"}},{"$f":"IF(VLOOKUP(E37,'PEI2021'!$A$6:$AD$130,27,FALSE)=\"\",\"NA\",(VLOOKUP(E37,'PEI2021'!$A$6:$AD$130,27,FALSE)))","v":{"$error":"#N/A"}},{"$f":"IF(VLOOKUP(E37,'PEI2021'!$A$6:$AD$130,28,FALSE)=\"\",\"NA\",(VLOOKUP(E37,'PEI2021'!$A$6:$AD$130,28,FALSE)))","v":{"$error":"#N/A"}},{"$f":"IF(VLOOKUP(E37,'PEI2021'!$A$6:$AD$130,29,FALSE)=\"\",\"NA\",(VLOOKUP(E37,'PEI2021'!$A$6:$AD$130,29,FALSE)))","v":{"$error":"#N/A"}}]
[]
[]
[]
[]
[null,null,null,null,0.8,0.8,0.8,0.8]

{"sheet":"PEI_MVCT_NUEVO","index":3,"n_rows":79,"n_cols":18,"rows_kept":79,"cut":false,"hidden":false,"merged":[[57,2,57,8],[58,2,58,3],[58,4,58,8],[59,2,59,8],[60,2,60,3],[60,4,60,8],[66,2,66,8],[67,2,67,3],[67,5,67,8],[61,2,61,8],[62,2,63,3],[64,2,64,8],[65,2,65,3],[65,4,65,8],[42,2,42,3],[42,4,42,8],[43,2,43,8],[1,8,4,9],[1,4,4,7],[54,2,54,3],[54,4,54,8],[49,2,49,8],[50,2,50,3],[50,4,50,8],[51,2,51,8],[52,2,52,3],[52,4,52,8],[53,2,53,8],[55,2,55,8],[56,2,56,3],[56,4,56,8],[5,2,5,9],[34,4,34,8],[35,2,35,8],[36,2,36,3],[22,2,22,8],[16,2,16,3],[16,4,16,8],[20,2,20,8],[36,4,36,8],[48,4,48,8],[34,2,34,3],[7,2,7,8],[38,2,38,3],[1,1,4,3],[6,2,6,8],[32,2,32,3],[32,4,32,8],[33,2,33,8],[31,2,31,8],[13,2,13,3],[13,4,13,8],[8,2,8,8],[9,2,9,3],[9,4,9,8],[10,2,10,8],[11,2,11,3],[11,4,11,8],[21,2,21,3],[21,4,21,8],[48,2,48,3],[17,2,17,8],[14,2,14,8],[15,2,15,8],[18,2,18,3],[18,4,18,8],[23,2,23,3],[19,2,19,8],[37,2,37,8],[40,2,40,3],[40,4,40,8],[47,2,47,8],[44,2,44,3],[38,4,38,8],[39,2,39,8],[41,2,41,8],[12,2,12,8],[44,4,44,8],[45,2,45,8],[46,2,46,3],[46,4,46,8],[23,4,23,8],[24,2,24,8],[25,2,25,3],[25,4,25,8],[30,2,30,8],[26,2,26,8],[27,2,27,3],[27,4,27,8],[28,2,28,8],[29,2,29,3],[29,4,29,8]]}
[]
[null,null,null,null,"FORMATO Captura de información para la Planeación Institucional\nPROCESO: Direccionamiento Estratégico"]
[]
[]
[]
[]
[]
[null,null,{"$f":"IF(Ele_Dep_MVCT!E12=\"\",\"Elegir una dependencia, oprimir el botón de la derecha Elegir Instrumento (PEI-PAI)\",\"Creación de indicador de PND o de GESTIÓN no incluidos en el PEI\")","v":"Elegir una dependencia, oprimir el botón de la derecha Elegir Instrumento (PEI-PAI)"}]
[{"$f":"Ele_Dep_MVCT!E12","v":0},null,"Plan Nacional de Desarrollo"]
[null,null,"Pactos relacionados",null,null,null,null,null,null,null,null,null,null,null,null,null,null,{"$f":"\"P\"&(MID(E10,1,FIND(\".\",E10,1)-1))","v":{"$error":"#VALUE!"}}]
[]
[null,null,"Línea",null,null,null,null,null,null,null,null,null,null,null,null,null,null,{"$f":"R10&\"L\"&(MID(E12,1,FIND(\".\",E12,1)-1))","v":{"$error":"#VALUE!"}}]
[]
[null,null,"Objetivo"]
[null,null,"Objetivos de Desarrollo Sostenible (ODS)"]
[]
[null,null,"Principal "]
[]
[null,null,"Secundario"]
[]
[null,null,"Información General"]
[null,null,"Dimensión Estratégica"]
[]
[null,null,"Objetivo Estratégico  Sector"]
[]
[null,null,"Objetivos estratégicos la entidad"]
[]
[null,null,"Proceso SIG"]
[]
[null,null,"Dimensión MIPG"]
[]
[null,null,"Hoja de vida del Indicador"]
[null,null,"Nombre del indicador"]
[]
[null,null,"Clasificación del indicador"]
[]
[null,null,"Objetivo del indicador"]
[]
[null,null,"Fórmula del indicador"]
[]
[null,null,"Definición de las variable 1 de la fórmula"]
[]
[null,null,"Definición de las variable 2 de la fórmula"]
[]
[null,null,"Definición de las variable 3 de la fórmula"]
[]
[null,null,"Definición de las variable 4 de la fórmula"]
[]
[null,null,"Tipología"]
[]
[null,null,"Unidad de medida"]
[]
[null,null,"Fuente de información"]
[]
[null,null,"Periodicidad"]
[]
[null,null,"Días de rezago"]
[]
[null,null,"Línea Base"]
[]
[null,null,"Fecha de la línea base"]
[]
[null,null,"METAS",null,2019,2020,2021,2022,"Cuatrienio"]
[]
[]
[null,null,"Tendencia"]
[]
[null,null,"Seguimiento ",null,"MENSUAL","Por parte de la Oficina Asesora de Planeación"]
[]
[]
[]
[]
[]
[]
[]
[]
[]
[]
[null,null,null,null,"","","",""]

{"sheet":"ListasPactos","index":4,"n_rows":5,"n_cols":39,"rows_kept":5,"cut":false,"hidden":true,"merged":[]}
["I. Pacto por la legalidad: seguridad efectiva y justicia transparente para que todos vivamos con libertad y en democracia","B. Imperio de la ley: derechos humanos, justicia accesible, oportuna y en toda Colombia, para todos","C. Alianza contra la corrupción: tolerancia cero con los corruptos","D. Colombia en la escena global: política exterior responsable, innovadora y constructiva",null,"III. Pacto por la Equidad: política social moderna centrada en la familia, eficiente, de calidad y conectada a mercados","E. Vivienda y entornos dignos e incluyentes",null,"V. Pacto por la ciencia, la tecnología y la innovación: un sistema para construir el conocimiento de la Colombia del futuro","D. Innovación pública para un país moderno",null,"VII. Pacto por la transformación digital de Colombia: gobierno, empresas y hogares conectados con la era del conocimiento","B. Hacia una sociedad digital e industria 4.0: por una relación más eficiente, efectiva y transparente entre mercados, ciudadanos y Estado",null,"VIII. Pacto por la calidad y eficiencia de los servicios públicos: agua y energía para promover la competitividad y el bienestar de todos","B. Agua limpia y saneamiento básico adecuado: hacia una gestión responsable, sostenible y equitativa",null,"XI. Pacto por la Construcción de Paz: Cultura de la legalidad, convivencia, estabilización y víctimas"," A. Acciones efectivas para la política de estabilización: intervención coordinada en zonas estratégicas con seguridad, justicia y equidad",null,"XII. Pacto por la equidad de oportunidades para grupos étnicos: Indígenas, Negros, Afrocolombianos, Raizales, Palenqueros y Rrom","B. Capítulo de grupos indígenas","C. Capítulo de Rrom","D. Capítulo de comunidades negras, afrocolombianas, raizales y palenqueras",null,"XIV. Pacto de equidad para las mujeres","C. El cuidado, una apuesta de articulación y corresponsabilidad",null,"XV. Pacto por una gestión pública efectiva","A. Transformación de la administración pública","B. Gasto público efectivo",null,"XVI. Pacto por la descentralización: conectar territorios, gobiernos y poblaciones","A. Políticas e inversiones para el desarrollo, el ordenamiento y el fortalecimiento de la asociatividad","C. Desarrollo urbano y Sistema de Ciudades (SC) para la sostenibilidad, la productividad y la calidad de vida","E. Instrumentos e información para la toma de decisiones que promuevan el desarrollo regional",null,"PPacto","PPactoLL"]
["Línea "]
["B. Imperio de la ley: derechos humanos, justicia accesible, oportuna y en toda Colombia, para todos","Objetivo 5. Defensa jurídica del Estado ","Objetivo 1. Pacto de cero tolerancia a la corrupción y a la falta de transparencia","Objetivo 1. Participación activa y liderazgo en la gobernanza de los grandes temas y desafíos de la agenda global que afectan a Colombia, y apuesta por el multilateralismo en defensa de la paz, la seguridad y la democracia",null,"E. Vivienda y entornos dignos e incluyentes","Objetivo 1. Mejorar las condiciones físicas y sociales de viviendas, entornos y asentamientos precarios, a través de la implementación de políticas para el mejoramiento de vivienda y barrios para los hogares de menores ingresos",null,"D. Innovación pública para un país moderno","Objetivo 5. Gestionar el conocimiento y los aprendizajes para crear valor público",null,"B. Hacia una sociedad digital e industria 4.0: por una relación más eficiente, efectiva y transparente entre mercados, ciudadanos y Estado","Objetivo 1. Impulsar la transformación digital de la administración pública ",null,"B. Agua limpia y saneamiento básico adecuado: hacia una gestión responsable, sostenible y equitativa","Objetivo 1. Implementar estrategias para el logro de una prestación eficiente, sostenible e incluyente de los servicios de APSB con orientación regional, y una política nacional de gestión integral de residuos sólidos que articule el concepto de economía circular",null,"A. Acciones efectivas para la política de estabilización: intervención coordinada en zonas estratégicas con seguridad, justicia y equidad","Objetivo 1. Estabilizar los territorios rurales, principalmente en los 170 municipios PDET",null,"B. Capítulo de grupos indígenas","Objetivo 6. Mejorar condiciones físicas y sociales de viviendas y entornos, a través de la implementación de políticas diferenciales, para el mejoramiento de las condiciones de habitabilidad de los hogares con menores ingresos en entornos rurales y urbanas","Objetivo 6. Mejorar condiciones físicas y sociales de viviendas y entornos, a través de la implementación de políticas diferenciales, para el mejoramiento de las condiciones de habitabilidad de los hogares con menores ingresos en entornos rurales y urbanas","Objetivo 6. Mejorar condiciones físicas y sociales de viviendas y entornos, a través de la implementación de políticas diferenciales, para el mejoramiento de las condiciones de habitabilidad de los hogares con menores ingresos en entornos rurales y urbanas",null,"C. El cuidado, una apuesta de articulación y corresponsabilidad","Objetivo 2. Generar lineamientos de articulación de la oferta de programas disponible a nivel territorial con enfoque de género para las mujeres para reducir las cargas de cuidado de las mujeres",null,"A. Transformación de la administración pública","Objetivo 1. Evaluar la arquitectura institucional del Gobierno con el fin de redefinir misiones, roles y competencias que permitan el funcionamiento eficiente del Estado en los diferentes niveles de gobierno","Objetivo 1. Fortalecer los instrumentos para la asignación estratégica y responsabilidad del gasto público ",null,"A. Políticas e inversiones para el desarrollo, el ordenamiento y el fortalecimiento de la asociatividad","Objetivo 2. Armonizar la planeación para el desarrollo y la planeación para el ordenamiento territorial","Objetivo 1. Lograr el desarrollo urbano equilibrado mediante el aprovechamiento de la ciudad construida, la planificación de la expansión y la suburbanización con criterios de sostenibilidad y la optimización de los instrumentos de financiamiento","Objetivo 2. Promover la implementación de la infraestructura de Datos Espaciales",null,"L."]
["C. Alianza contra la corrupción: tolerancia cero con los corruptos",null,null,null,null,null,"Objetivo 2. Profundizar el acceso a soluciones de vivienda digna, a través de la complementariedad de esquemas de compra y arriendo subsidiado de vivienda y la facilitación del financiamiento formal a los hogares de menores ingresos",null,null,null,null,null,null,null,null,"Objetivo 4. Incorporar las modificaciones pertinentes al esquema y capacidad institucional del sector, para mejorar la ejecución de proyectos y fortalecer la vigilancia y regulación oportuna y diferenciada a las empresas",null,null,null,null,"C. Capítulo de Rrom",null,null,null,null,null,null,null,"B. Gasto público efectivo","Objetivo 2. Mejorar la eficiencia y productividad en la gestión y las capacidades de las entidades públicas de los sectores","Objetivo 2. Simplificar y optimizar la contratación pública ",null,"C. Desarrollo urbano y Sistema de Ciudades (SC) para la sostenibilidad, la productividad y la calidad de vida",null,"Objetivo 2. Consolidar el SC como dinamizador del desarrollo territorial y la productividad"]
["D. Colombia en la escena global: política exterior responsable, innovadora y constructiva",null,null,null,null,null,"Objetivo 3. Incrementar la productividad del sector de la construcción, a través del fortalecimiento y la formalización de la mano de obra, la mejora de procesos constructivos y la adopción de tecnologías y buenas prácticas gerenciales",null,null,null,null,null,null,null,null,"Objetivo 5. Adoptar medidas para proteger las fuentes de agua y garantizar su sostenibilidad en el tiempo, con un enfoque de Economía Circular",null,null,null,null,"D. Capítulo de comunidades negras, afrocolombianas, raizales y palenqueras",null,null,null,null,null,null,null,null,null,"Objetivo 3. Optimizar la administración del patrimonio del Estado y la gestión de activos",null,"E. Instrumentos e información para la toma de decisiones que promuevan el desarrollo regional"]

{"sheet":"Indicadores PEI","index":5,"n_rows":74,"n_cols":10,"rows_kept":74,"cut":false,"hidden":true,"merged":[[1,2,2,2],[1,1,2,1],[0,1,0,2],[0,4,0,5],[1,4,2,4],[1,5,2,5]]}
[null,"Gestión",null,null,"PND"]
[null,"Indicador","Dependencia \nResponsable",null,"Indicador","Dependencia \nResponsable",null,{"$f":"73+38","v":111}]
[]
["GindDDS","Instrumentos normativos actualizados y/o elaborados y publicados","DEUT-Dirección de Espacio Urbano y Territorial","PindDDS","Área de suelo habilitado","DEUT-Dirección de Espacio Urbano y Territorial",null,null,null,{"$f":"C3=C2","v":false}]
[null,"Acciones institucionales que aseguran una gestión pública más efectiva ","DIDE-Dirección de Infraestructura y Desarrollo Empresarial",null,"Hogares beneficiados con mejoramiento integral de barrios ","DEUT-Dirección de Espacio Urbano y Territorial",null,null,null,{"$f":"C4=C3","v":false}]
[null,"Asistencias técnicas realizadas","DIDE-Dirección de Infraestructura y Desarrollo Empresarial",null,"Municipios acompañados en la revisión e implementación de los planes de ordenamiento territorial (POT)","DEUT-Dirección de Espacio Urbano y Territorial",null,null,null,{"$f":"C5=C4","v":false}]
[null,"Lineamientos de política pública para el fortalecimiento de capacidades en el sector de APSB","DIDE-Dirección de Infraestructura y Desarrollo Empresarial",null,"Nuevas conexiones Intradomiciliarias","DIDE-Dirección de Infraestructura y Desarrollo Empresarial",null,null,null,{"$f":"C6=C5","v":true}]
[null,"Nuevos esquemas regionales de prestación del servicio estructurados","DIDE-Dirección de Infraestructura y Desarrollo Empresarial",null,"Personas beneficiadas con proyectos que mejoran provisión, calidad y/o continuidad de los servicios de acueducto y alcantarillado","DIDE-Dirección de Infraestructura y Desarrollo Empresarial",null,null,null,true]
[null,"Proyectos de inversión evaluados por el mecanismo de viabilización","DIDE-Dirección de Infraestructura y Desarrollo Empresarial",null,"Hogares beneficiados con cobertura para adquisición de vivienda","DIVIS-Dirección de Inversiones en Vivienda de Interés Social",null,null,null,true]
[null,"Porcentaje de subsidios asignados a los hogares víctimas de desplazamiento forzado en los programas de vivienda","DIVIS-Dirección de Inversiones en Vivienda de Interés Social",null,"Hogares beneficiados con subsidio familiar para adquisición de vivienda","DIVIS-Dirección de Inversiones en Vivienda de Interés Social",null,null,null,true]
[null,"Viviendas mejoradas entregadas a mujeres","DIVIS-Dirección de Inversiones en Vivienda de Interés Social",null,"Hogares beneficiados con subsidios para arrendamiento de vivienda de interés social urbana","DIVIS-Dirección de Inversiones en Vivienda de Interés Social",null,null,null,false]
[null,"Viviendas mejoradas entregadas en municipios PDET","DIVIS-Dirección de Inversiones en Vivienda de Interés Social",null,"Subsidios en especie de vivienda de interés social rural asignados a familias de las comunidades indígenas Nukak y Jiw","DIVIS-Dirección de Inversiones en Vivienda de Interés Social",null,null,null,true]
[null,"Viviendas nuevas entregadas a mujeres","DIVIS-Dirección de Inversiones en Vivienda de Interés Social",null,"Subsidios Familiares de Vivienda Entregados a Mujeres Cabeza de Familia","DIVIS-Dirección de Inversiones en Vivienda de Interés Social",null,null,null,true]
[null,"Viviendas nuevas entregadas en municipios PDET","DIVIS-Dirección de Inversiones en Vivienda de Interés Social",null,"Subsidios para mejoramiento de vivienda rural asignados a indígenas Nukak y Jiw","DIVIS-Dirección de Inversiones en Vivienda de Interés Social",null,null,null,true]
[null,"Porcentaje de  compromisos adquiridos a los que se les hace seguimiento","DM-Despacho de Ministro",null,"Viviendas de Interés social rural construidas","DIVIS-Dirección de Inversiones en Vivienda de Interés Social",null,null,null,true]
[null,"Porcentaje de integrantes del sector político (congresistas, entes territoriales) atendidos","DM-Despacho de Ministro",null,"Viviendas de Interés Social Rural mejoradas","DIVIS-Dirección de Inversiones en Vivienda de Interés Social",null,null,null,false]
[null,"Porcentaje de proyectos de ley con postura del Ministerio","DM-Despacho de Ministro",null,"Viviendas de interés social urbanas mejoradas (Fonvivienda)","DIVIS-Dirección de Inversiones en Vivienda de Interés Social",null,null,null,true]
[null,"Porcentaje de relaciones formalizadas con cooperantes","DM-Despacho de Ministro",null,"Diagnóstico de las condiciones de acceso a agua potable y saneamiento básico concertado con las comunidades indígenas realizado","DPR-Dirección de Política y Regulación",null,null,null,true]
[null,"Porcentaje de solicitudes respondidas","DM-Despacho de Ministro",null,"Estudio concertado sobre potabilidad y acceso al agua según las particularidades del territorio y la cosmovisión del pueblo indígena que lo requieran","DPR-Dirección de Política y Regulación",null,null,null,true]
[null,"Estudios y propuestas de disposiciones o modificaciones normativas o de política del sector (APSB)","DPR-Dirección de Política y Regulación",null,"Mesas territoriales implementadas en el marco del Programa Agua al Campo en Meta, Guaviare y Guajira con participación de los pueblos indígenas concernidos","DPR-Dirección de Política y Regulación",null,null,null,true]
[null,"Número de asistencias técnicas realizadas a los grupos de valor en el marco de las competencias del VASB reportadas en el sistema de información","DPR-Dirección de Política y Regulación",null,"Municipios con esquemas de aprovechamiento en operación","DPR-Dirección de Política y Regulación",null,null,null,false]
[null,"Personas beneficiadas con proyectos que mejoran provisión, calidad y/o continuidad de los servicios de acueducto y alcantarillado, en el marco del programa Guajira Azul","DPR-Dirección de Política y Regulación",null,"Porcentaje de aguas residuales urbanas tratadas","DPR-Dirección de Política y Regulación",null,null,null,true]
[null,"Porcentaje de Municipios con riesgo alto identificados por el Grupo SGP","DPR-Dirección de Política y Regulación",null,"Porcentaje de asistencias técnicas a prestadores que atienden territorios indígenas en municipios priorizados","DPR-Dirección de Política y Regulación",null,null,null,true]
[null,"Empresas beneficiadas con el programa de Fábricas de Productividad para la Construcción","DSH-Dirección del Sistema Habitacional",null,"Porcentaje de asistencias técnicas brindadas a los departamentos en el marco de los Planes Departamentales de Agua en proyectos de agua y saneamiento básico concertada con las comunidades negras, afro, raizales y Palenqueras","DPR-Dirección de Política y Regulación",null,null,null,true]
[null,"Estudios del sector de la construcción y vivienda publicados","DSH-Dirección del Sistema Habitacional",null,"Porcentaje de comunidades priorizados indígenas de los pueblos Wayuu, Jiw y Nukak con acceso a agua potable y saneamiento básico","DPR-Dirección de Política y Regulación",null,null,null,false]
[null,"Proyectos Normativos Publicados","DSH-Dirección del Sistema Habitacional",null,"Porcentaje de hogares con servicio de recolección de basuras ","DPR-Dirección de Política y Regulación",null,null,null,true]
[null,"Porcentaje de soluciones de vivienda estructuradas y ejecutadas con participación de la comunidad beneficiada","DVR-Dirección de Vivienda Rural",null,"Porcentaje de hogares con servicio de recolección de basuras en zona rural ","DPR-Dirección de Política y Regulación",null,null,null,true]
[null,"Porcentaje de soluciones de vivienda estructuradas y ejecutadas con participación de la comunidad beneficiada en municipios PDET","DVR-Dirección de Vivienda Rural",null,"Porcentaje de hogares con servicio de recolección de basuras en zona urbana","DPR-Dirección de Política y Regulación",null,null,null,false]
[null,"Elaboración de los instrumentos Archivísticos del MVCT","GAUA-Grupo de Atención al Usuario y Archivo",null,"Porcentaje de hogares rurales con acceso a soluciones adecuadas de agua potable en municipios PDET (PAZ)","DPR-Dirección de Política y Regulación",null,null,null,true]
[null,"Número de reportes de  informacion gestionada y tramitada","GAUA-Grupo de Atención al Usuario y Archivo",null,"Porcentaje de hogares rurales con acceso a soluciones adecuadas para el manejo de aguas residuales en municipios PDET (PAZ)","DPR-Dirección de Política y Regulación",null,null,null,false]
[null,"Satisfacción del peticionario con relación a la respuesta recibida por parte del MVCT","GAUA-Grupo de Atención al Usuario y Archivo",null,"Porcentaje de municipios que tratan adecuadamente los residuos sólidos ","DPR-Dirección de Política y Regulación",null,null,null,true]
[null,"Satisfacción del usuario atendido de forma personalizada","GAUA-Grupo de Atención al Usuario y Archivo",null,"Porcentaje de reciclaje en el marco del servicio público de aseo","DPR-Dirección de Política y Regulación",null,null,null,true]
[null,"Evaluación de la comunicación interna","GCE-Grupo de Comunicaciones Estratégicas",null,"Porcentaje de reglamentación del Título V del Decreto 1953 de 2014 en el marco de la comisión de impulso liderada por el Ministerio del Interior","DPR-Dirección de Política y Regulación",null,null,null,true]
[null,"Porcentaje de noticias positivas relacionadas con el sector publicadas en medios de comunicación","GCE-Grupo de Comunicaciones Estratégicas",null,"Porcentaje de residuos sólidos urbanos dispuestos adecuadamente","DPR-Dirección de Política y Regulación",null,null,null,false]
[null,"Eficiencia en el tiempo de revisión de los procesos contractuales por parte del Grupo de Contratos","GC-Grupo de Contratos ",null,"Porcentaje de territorios indígenas sin acceso a agua potable y/o saneamiento básico con proyectos formulados por la comunidad con apoyo técnico del equipo del viceministerio de agua y del Plan Departamental de Agua, y financiados por OCADPaz","DPR-Dirección de Política y Regulación",null,null,null,true]
[null,"Actividades de prevención desarrolladas durante el año ","GCID-Grupo de Control Interno Disciplinario ",null,"Nuevas personas con acceso a soluciones adecuadas de agua potable (Amazonía)","DPR-Dirección de Política y Regulación ",null,null,null,false]
[null,"Porcentaje de procesos aperturados en el mes","GCID-Grupo de Control Interno Disciplinario ",null,"Nuevas personas con acceso a soluciones adecuadas de agua potable (Caribe)","DPR-Dirección de Política y Regulación ",null,null,null,false]
[null,"Diagnóstico de la infraestructura de las Sedes del Ministerio de Vivienda, Ciudad y Territorio realizado","GRF-Grupo de Recursos Físicos",null,"Nuevas personas con acceso a soluciones adecuadas de agua potable (Pacífico)","DPR-Dirección de Política y Regulación ",null,null,null,true]
[null,"Porcentaje de avance en la solución integral a la ubicación de las sedes del MVCT","GRF-Grupo de Recursos Físicos",null,"Nuevas personas con acceso a soluciones adecuadas de agua potable (Seaflower)","DPR-Dirección de Política y Regulación ",null,null,null,false]
[null,"Porcentaje de mantenimientos preventivos realizados a los bienes muebles e inmuebles del Ministerio","GRF-Grupo de Recursos Físicos",null,"Nuevas personas con acceso a soluciones adecuadas para el manejo de aguas residuales (Amazonía)","DPR-Dirección de Política y Regulación ",null,null,null,true]
[null,"Porcentaje de servicios atendidos solicitados por las dependencias del MVCT al Grupo de Recursos Físicos","GRF-Grupo de Recursos Físicos",null,"Nuevas personas con acceso a soluciones adecuadas para el manejo de aguas residuales (Pacífico)","DPR-Dirección de Política y Regulación ",null,null,null,true]
[null,"Avance del Plan Anual de Empleos Vacantes","GTH-Grupo de Talento Humano",null,"Personas con acceso a soluciones adecuadas de agua potable (Totaliza)","DPR-Dirección de Política y Regulación ",null,null,null,true]
[null,"Avance del Plan Anual de Seguridad y Salud en el Trabajo","GTH-Grupo de Talento Humano",null,"Personas con acceso a soluciones adecuadas de agua potable en zona rural ","DPR-Dirección de Política y Regulación ",null,null,null,false]
[null,"Avance del Plan de Previsión","GTH-Grupo de Talento Humano",null,"Personas con acceso a soluciones adecuadas de agua potable en zona urbana","DPR-Dirección de Política y Regulación ",null,null,null,true]
[null,"Avance del Plan Institucional de Capacitación","GTH-Grupo de Talento Humano",null,"Personas con acceso a soluciones adecuadas para el manejo de aguas residuales (Totaliza)","DPR-Dirección de Política y Regulación ",null,null,null,true]
[null,"Avance del Programa de Bienestar Social e Incentivos","GTH-Grupo de Talento Humano",null,"Personas con acceso a soluciones adecuadas para el manejo de aguas residuales en zona rural ","DPR-Dirección de Política y Regulación ",null,null,null,true]
[null,"Crecimiento del puntaje asignado a la dimensión de Talento humano (TH) a partir del FURAG","GTH-Grupo de Talento Humano",null,"Personas con acceso a soluciones adecuadas para el manejo de aguas residuales en zona urbana ","DPR-Dirección de Política y Regulación ",null,null,null,true]
[null,"Porcentaje  de fallos  de tutela favorables de vivienda urbana","OAJ-Oficina Asesora Jurídica",null,"Decreto expedido en 2019","DSH-Dirección del Sistema Habitacional",null,null,null,true]
[null,"Porcentaje de actas de audiencias entregadas por apoderado","OAJ-Oficina Asesora Jurídica",null,"Documento normativo donde se establezcan los porcentajes participación de las mujeres cabeza de familia(…)","DSH-Dirección del Sistema Habitacional",null,null,null,false]
[null,"Porcentaje de Fichas allegadas y presentadas ante el comité de conciliación","OAJ-Oficina Asesora Jurídica",null,"Mesa de trabajo con el sector financiero para proponer una línea de crédito flexible con bajas tasa de interés dirigida a grupos étnicos para adquisición de vivienda nueva","DSH-Dirección del Sistema Habitacional",null,null,null,true]
[null,"Porcentaje de respuestas a conceptos, peticiones, reclamaciones y solicitudes de revisión normativa emitidas en término","OAJ-Oficina Asesora Jurídica",null,"Porcentaje de hogares urbanos con déficit cualitativo de vivienda ","DSH-Dirección del Sistema Habitacional",null,null,null,true]
[null,"Porcentaje de sanciones allegadas respecto a las tutelas allegadas","OAJ-Oficina Asesora Jurídica",null,"Porcentaje de hogares urbanos con déficit cuantitativo de vivienda","DSH-Dirección del Sistema Habitacional",null,null,null,true]
[null,"Tasa de exito procesal","OAJ-Oficina Asesora Jurídica",null,"Viviendas de Interés Social Urbanas iniciadas","DSH-Dirección del Sistema Habitacional",null,null,null,true]
[null,"Crecimiento del puntaje asignado a la Política de Control Interno (CI) a partir del FURAG","OAP-Oficina Asesora de Planeación ",null,"Viviendas urbanas de interés social tituladas","DSH-Dirección del Sistema Habitacional",null,null,null,true]
[null,"Crecimiento del puntaje asignado a la Política de Fortalecimiento Organizacional  y Simplificación de Procesos FOSP a partir del FURAG","OAP-Oficina Asesora de Planeación ",null,"Déficit cualitativo y cuantitativo de vivienda rural","DVR-Dirección de Vivienda Rural",null,null,null,false]
[null,"Crecimiento del puntaje asignado a la Política de Gestión del Conocimiento y la Innovación (GCI) a partir del FURAG ","OAP-Oficina Asesora de Planeación ",null,"Déficit cualitativo y cuantitativo de vivienda rural en municipios PDET","DVR-Dirección de Vivienda Rural",null,null,null,true]
[null,"Crecimiento del puntaje asignado a la Política de Participación Ciudadana y Rendición de Cuentas PCRC a partir del FURAG","OAP-Oficina Asesora de Planeación ",null,"Documento de anexo técnico concertado de tipologías de vivienda de los pueblos indígenas","DVR-Dirección de Vivienda Rural",null,null,null,true]
[null,"Crecimiento del puntaje asignado a la política de Planeación Institucional (PI) a partir del FURAG","OAP-Oficina Asesora de Planeación ",null,"Documento que sirva de insumo para el Anexo Técnico y que contenga las especificaciones técnicas de las tipologías de vivienda(…)","DVR-Dirección de Vivienda Rural",null,null,null,true]
[null,"Crecimiento del puntaje asignado a la Política de Racionalización de Trámites a partir del FURAG","OAP-Oficina Asesora de Planeación ",null,"Expedición de un instrumento normativo que garantice la focalización y postulación de los hogares pertenecientes a las comunidades indígenas","DVR-Dirección de Vivienda Rural",null,null,null,true]
[null,"Crecimiento del puntaje asignado a la Política de Seguimiento y Evaluación  al Desempeño Institucional a partir del FURAG","OAP-Oficina Asesora de Planeación ",null,"Porcentaje de implementación del Sistema de Información Transaccional","OTIC-Oficina de Tecnologías de Información y Comunicaciones ",null,null,null,true]
[null,"Nivel de cumplimiento del Plan Anual de Auditorías","OCI-Oficina de Control Interno",null,null,null,null,null,null,true]
[null,"Avance en el  Índice de Transparencia y Acceso a la Información (ITA) de la Procuraduría General de la Nación (PGN)","OTIC-Oficina de Tecnologías de Información y Comunicaciones ",null,null,null,null,null,null,false]
[null,"Avance en la implementación de las actividades (mapa de ruta)  del PETI- 2018-2022","OTIC-Oficina de Tecnologías de Información y Comunicaciones ",null,null,null,null,null,null,false]
[null,"Estados Financieros presentados","SFP-Subdirección de Finanzas y Presupuesto",null,null,null,null,null,null,true]
[null,"Informe de Seguimiento a la Ejecución Presupuestal","SFP-Subdirección de Finanzas y Presupuesto",null,null,null,null,null,null,false]
[null,"PAC ejecutado","SFP-Subdirección de Finanzas y Presupuesto",null,null,null,null,null,null,true]
[null,"Informe de Seguimiento a la Ejecución Presupuestal","SFP-Subdirección de Finanzas y Presupuesto",null,null,null,null,null,null,true]
[null,"Estados Financieros presentados","SFP-Subdirección de Finanzas y Presupuesto",null,null,null,null,null,null,true]
[null,"PAC ejecutado","SFP-Subdirección de Finanzas y Presupuesto",null,null,null,null,null,null,true]
[null,"Avance en la ejecución del Plan Anual de Adquisiciones (PAA) formulado y actualizado de gastos generales","SSA - Subdirección de Servicios Administrativos",null,null,null,null,null,null,{"$f":"C69=C68","v":true}]
[null,"Porcentaje de avance en la solución integral a la ubicación de las sedes del MVCT","SSA - Subdirección de Servicios Administrativos",null,null,null,null,null,null,false]
[null,"Activos del extinto ICT-INURBE Intervenidos","SSA - Subdirección de Servicios Administrativos",null,null,null,null,null,null,true]
[null,"Activos del extinto ICT INURBE intervenidos","SSA - Subdirección de Servicios Administrativos",null,null,null,null,null,null,true]
[null,"Avance en la ejecución del Plan Anual de Adquisiciones (PAA) formulado y actualizado de los gastos de funcionamiento que son competencia de la SSA","SSA - Subdirección de Servicios Administrativos",null,null,null,null,null,null,true]

{"sheet":"PEI-PRELIMINAR","index":6,"n_rows":7,"n_cols":35,"rows_kept":7,"cut":false,"hidden":false,"merged":[[5,22,6,22],[5,13,6,13],[0,31,2,34],[0,5,2,30],[0,0,2,4],[5,16,6,16],[5,24,6,24],[5,3,6,3],[5,15,6,15],[5,17,6,17],[5,23,6,23],[5,18,6,18],[5,19,6,19],[5,20,6,20],[5,27,6,27],[5,25,6,25],[5,21,6,21],[5,14,6,14],[5,26,6,26],[3,0,4,34],[5,2,6,2],[5,0,6,0],[5,4,6,4],[5,5,6,5],[5,6,6,6],[5,7,5,9],[5,1,6,1],[5,28,5,31],[5,32,6,32],[5,34,6,34],[5,33,6,33],[5,10,5,11],[5,12,6,12]]}
[null,null,null,null,null,"FORMATO Captura de información para la Planeación Institucional\nPROCESO: Direccionamiento Estratégico"]
[]
[]
[]
[]
["Entidad","Acción","Observaciones","Clasificación del indicador","Dimensión Estratégica","Objetivo Estratégico Sector","Objetivo Estratégico Entidad","PND",null,null,"ODS",null,"Dimensión MIPG","Proceso SIG Entidad","Indicador","Objetivo del indicador","Fórmula del Indicador","Definición variable 1 de la fórmula","Definición variable 2 de la fórmula","Definición variable 3 de la fórmula","Definición variable 4 de la fórmula","Tipología","Unidad de Medida","Fuente de información","Periodicidad","Días de rezago","Línea Base","Fecha de la línea base","Metas",null,null,null,"Meta del Cuatrienio","Tendencia","Dependencia \nResponsable"]
[null,null,null,null,null,null,null,"Pacto","Línea","Objetivo ","Principal ","Secundario",null,null,null,null,null,null,null,null,null,null,null,null,null,null,null,null,2019,2020,2021,2022]

{"sheet":"Resumen PEI","index":7,"n_rows":33,"n_cols":17,"rows_kept":33,"cut":false,"hidden":false,"merged":[[20,3,21,17],[26,5,27,5],[29,5,31,5],[22,6,22,14],[1,1,9,3],[12,1,14,6],[16,1,18,6],[10,8,10,15],[10,5,10,7],[1,4,9,19]]}
[]
[null,null,null,null,"FORMATO: Captura de información para la Planeación Institucional\nPROCESO: Direccionamiento Estratégico"]
[]
[]
[]
[]
[]
[]
[]
[]
[null,null,null,null,null,"Su dependencia",null,null,{"$f":"Ele_Dep_MVCT!E12","v":0},null,null,null,null,null,null,null,{"$f":"MID(I11,1,FIND(\"-\",I11,1)-1)","v":{"$error":"#VALUE!"}}]
[]
[null,{"$f":"IF((J28+H28)<H32,\"ALERTA: Se ha encontrado que la dependencia\"&\" \"&I11&\" \"&\"no ha validado \"&H32-(H28+J28)&\" indicadores de Gestión de la vigencia 2021. Por favor regresar a la herramienta y validar estos indicadores.\",\"\")","v":""}]
[]
[]
[]
[null,{"$f":"IF((J27+H27)<H31,\"ALERTA: Se ha encontrado que la dependencia\"&\" \"&I11&\" \"&\"no ha validado \"&H31-(H27+J27)&\" indicadores de PND de la vigencia 2021. Por favor regresar a la herramienta y validar estos indicadores.\",\"\")","v":""}]
[]
[]
[]
[null,null,null,{"$f":"\"Ha registrado \"&(COUNTIFS('PEI-PRELIMINAR'!B6:B86,\"Creación\")+COUNTIFS('PEI-PRELIMINAR'!B6:B86,\"*\"&\"Modificación\"&\"*\"))&\" \"&\"Indicadores\"&IF((COUNTIFS('PEI-PRELIMINAR'!B6:B86,\"Eliminación\"))>0,\" y ha eliminado  \"&(COUNTIFS('PEI-PRELIMINAR'!B6:B86,\"Eliminación\")),\"\")","v":"Ha registrado 0 Indicadores"}]
[]
[null,null,null,null,null,null,{"$f":"IF(AND(J27>0,J28>0),IF(J27>1,\"La dependencia eliminó \"&J27&\" indicadores de PND y\",\"La dependencia eliminó \"&J27&\" indicador de PND y\")&\" \"&IF(J28>1,\"\"&J28&\" indicadores de Gestión.\",\"\"&J28&\" indicador de Gestión.\"),(IF(J27>0,IF(J27>1,\"La dependencia eliminó \"&J27&\" indicadores de PND.\",\"La dependencia eliminó \"&J27&\" indicador de PND.\"),(IF(J28>0,IF(J28>1,\"La dependencia eliminó \"&J28&\" indicadores de Gestión.\",\"La dependencia eliminó \"&J28&\" indicador de Gestión.\"),\"\")))))","v":""}]
[]
[]
[null,null,null,null,null,null,"Tipo de indicador","Antiguo","Creado","Eliminado"]
[null,null,null,null,null,"Ahora","PND",{"$f":"COUNTIFS('PEI-PRELIMINAR'!$D$6:$D$93,\"*\"&\"PND\"&\"*\",'PEI-PRELIMINAR'!$B$6:$B$93,\"*\"&\"Modificación\"&\"*\")","v":0},{"$f":"COUNTIFS('PEI-PRELIMINAR'!$D$6:$D$93,\"*\"&\"PND\"&\"*\",'PEI-PRELIMINAR'!$B$6:$B$93,\"Creación\")","v":0},{"$f":"COUNTIFS('PEI-PRELIMINAR'!$D$6:$D$93,\"*\"&\"PND\"&\"*\",'PEI-PRELIMINAR'!$B$6:$B$93,\"Eliminación\")","v":0},null,null,null,null,null,{"$f":"IF(J27>0,IF(J27>1,\"La dependencia eliminó \"&J27&\" indicadores de PND.\",\"La dependencia eliminó \"&J27&\" indicador de PND.\"),IF(J28>0,IF(J28>1,\"La dependencia eliminó \"&J28&\" indicadores de Gestión.\",\"La dependencia eliminó \"&J28&\" indicador de Gestión.\")))","v":false}]
[null,null,null,null,null,null,"Gestión",{"$f":"COUNTIFS('PEI-PRELIMINAR'!$D$6:$D$93,\"*\"&\"Gestión\"&\"*\",'PEI-PRELIMINAR'!$B$6:$B$93,\"*\"&\"Modificación\"&\"*\")","v":0},{"$f":"+COUNTIFS('PEI-PRELIMINAR'!$D$6:$D$93,\"*\"&\"Gestión\"&\"*\",'PEI-PRELIMINAR'!$B$6:$B$93,\"Creación\")","v":0},{"$f":"COUNTIFS('PEI-PRELIMINAR'!$D$6:$D$93,\"*\"&\"Gestión\"&\"*\",'PEI-PRELIMINAR'!$B$6:$B$93,\"Eliminación\")","v":0}]
[]
[null,null,null,null,null,"Antes","Tipo de indicador",null,null,null,null,null,null,null,"Ahora",{"$f":"IF(AND(J27>0,J28>0),IF(J27>1,\"La dependencia eliminó \"&J27&\" indicadores de PND y\",\"La dependencia eliminó \"&J27&\" indicador de PND y\")&\" \"&IF(J28>1,\"\"&J28&\" indicadores de Gestión.\",\"\"&J28&\" indicador de Gestión.\"),(IF(J27>0,IF(J27>1,\"La dependencia eliminó \"&J27&\" indicadores de PND.\",\"La dependencia eliminó \"&J27&\" indicador de PND.\"),(IF(J28>0,IF(J28>1,\"La dependencia eliminó \"&J28&\" indicadores de Gestión.\",\"La dependencia eliminó \"&J28&\" indicador de Gestión.\"),\"\")))))","v":""}]
[null,null,null,null,null,null,"PND",{"$f":"COUNTIFS('PEI2021'!$AD$6:$AD$127,I11,'PEI2021'!$AH$6:$AH$127,\"*\"&\"PND\"&\"*\")","v":0},null,null,null,null,null,null,null,{"$f":"(IF(J27>0,IF(J27>1,\"La dependencia eliminó \"&J27&\" indicadores de PND.\",\"La dependencia eliminó \"&J27&\" indicador de PND.\"),\"NADA\"))","v":"NADA"}]
[null,null,null,null,null,null,"Gestión",{"$f":"COUNTIFS('PEI2021'!$AD$6:$AD$127,I11,'PEI2021'!$AH$6:$AH$127,\"*\"&\"Gestión\"&\"*\")","v":0},null,null,null,null,null,null,null,{"$f":"(IF(J28>0,IF(J28>1,\"La dependencia eliminó \"&J28&\" indicadores de Gestión.\",\"La dependencia eliminó \"&J28&\" indicador de Gestión.\"),\"\"))","v":""}]
[null,null,null,null,null,null,null,null,null,null,null,null,null,null,"Antes",{"$f":"IF((J27+J28)>0,IF(J27>J28,\"La dependencia eliminó \"&J27&(IF(J27<2,\" indicador de PND\",\" indicadores de PND\"))&IF(J28>0,\" y \"&J28&\" indicadores de Gestión\",\".\"),\"La dependencia eliminó \"&J28&\" indicadores de Gestión\"&IF(J27>0,\" y \"&J27&\" indicadores de PND\")),\".\")","v":"."}]

{"sheet":"FORMATO PAI","index":8,"n_rows":439,"n_cols":68,"rows_kept":439,"cut":false,"hidden":false,"merged":[[17,2,18,2],[9,2,9,29],[10,2,10,29],[16,2,16,29],[12,2,12,29],[13,2,13,8],[13,9,13,29],[14,2,14,29],[15,2,15,8],[15,9,15,29],[11,2,11,8],[11,9,11,29],[20,35,20,36],[21,35,22,36],[29,3,29,29],[30,3,30,30],[18,32,18,34],[17,3,18,3],[17,8,18,8],[17,10,17,21],[17,4,17,7],[17,9,18,9],[17,22,18,22],[17,23,17,24],[19,35,19,36],[17,25,17,28],[17,29,18,29],[7,2,7,29],[8,2,8,8],[8,9,8,29],[5,3,5,30],[1,1,4,5],[1,6,4,30]]}
[null,null,null,null,null,null,null,null,null,null,null,null,null,null,null,null,null,null,null,null,null,null,null,null,null,null,null,null,null,null,null,null,null,null,null,null,null,null,null,null,null,null,null,null,null,null,null,null,null,null,null,null,null,null,null,null,null,"Indicador","Acción","","Hogares beneficiados con subsidios para arrendamiento de vivienda de interés social urbana"]
[null,null,null,null,null,null,"FORMATO: Captura de información para la Planeación Institucional\nPROCESO: Direccionamiento Estratégico",null,null,null,null,null,null,null,null,null,null,null,null,null,null,null,null,null,null,null,null,null,null,null,null,null,null,null,null,null,null,null,null,null,null,null,null,null,null,null,null,null,null,null,null,null,null,null,null,null,null,null,null,"",""]
[null,null,null,null,null,null,null,null,null,null,null,null,null,null,null,null,null,null,null,null,null,null,null,null,null,null,null,null,null,null,null,null,null,null,null,null,null,null,null,null,null,null,null,null,null,null,null,null,null,null,null,null,null,null,null,null,null,null,null,"",""]
[null,null,null,null,null,null,null,null,null,null,null,null,null,null,null,null,null,null,null,null,null,null,null,null,null,null,null,null,null,null,null,null,null,null,null,null,null,null,null,null,null,null,null,null,null,null,null,null,null,null,null,null,null,null,null,null,null,null,null,"",""]
[null,null,null,null,null,null,null,null,null,null,null,null,null,null,null,null,null,null,null,null,null,null,null,null,null,null,null,null,null,null,null,null,null,null,null,null,null,null,null,null,null,null,null,null,null,null,null,null,null,null,null,null,null,null,null,null,null,null,null,"",""]
[null,null,null,null,null,null,null,null,null,null,null,null,null,null,null,null,null,null,null,null,null,null,null,null,null,null,null,null,null,null,null,null,null,null,null,null,null,null,null,null,null,null,null,null,null,null,null,null,null,null,null,null,null,null,null,null,null,null,null,"",""]
[null,null,null,null,null,null,null,null,null,null,null,null,null,null,null,null,null,null,null,null,null,null,null,null,null,null,null,null,null,null,null,null,null,null,null,null,null,null,null,null,null,null,null,null,null,null,null,null,null,null,null,null,null,null,null,null,null,null,null,"",""]
[null,null,"Responsabilidad",null,null,null,null,null,null,null,null,null,null,null,null,null,null,null,null,null,null,null,null,null,null,null,null,null,null,null,null,null,null,null,null,null,null,null,null,null,null,null,null,null,null,null,null,null,null,null,null,null,null,null,null,null,null,null,null,"",""]
[null,null,"Dependencia Responsable",null,null,null,null,null,null,{"$f":"Ele_Dep_MVCT!E12","v":0},null,null,null,null,null,null,null,null,null,null,null,null,null,null,null,null,null,null,null,null,null,null,null,null,null,null,null,null,null,null,null,"Cuadro de apoyo",null,null,null,null,null,null,null,null,null,null,null,null,null,null,null,null,null,"",""]
[null,null,null,null,null,null,null,null,null,null,null,null,null,null,null,null,null,null,null,null,null,null,null,null,null,null,null,null,null,null,null,null,null,null,null,null,null,null,null,null,null,null,null,null,null,null,null,null,null,null,null,null,null,null,null,null,null,null,null,"","",null,null,null,null,null,null,""]
[null,null,"Enlace con Planeación Estratégica",null,null,null,null,null,null,null,null,null,null,null,null,null,null,null,null,null,null,null,null,null,null,null,null,null,null,null,null,null,null,null,null,null,null,null,null,null,null,"Dimensión de MIPG",{"$f":"INDEX('PEI-PRELIMINAR'!A6:AI72,MATCH(J12,'PEI-PRELIMINAR'!O6:O74,0),13)","v":{"$error":"#N/A"}},"Dimensión del MIPG",null,"Código y Nombre de la Política",null,null,null,null,null,null,null,null,null,null,null,null,null,"","",null,null,null,null,null,null,""]
[null,null,"Indicador PEI relacionado",null,null,null,null,null,null,null,null,null,null,null,null,null,null,null,null,null,null,null,null,null,null,null,null,null,null,null,null,null,null,null,null,null,null,null,null,null,null,null,{"$f":"VLOOKUP(AQ11,AR11:AT29,2,FALSE)","v":{"$error":"#N/A"}},"Dimensión 1. Talento Humano","D_1","Política 1: Gestión Estratégica del Talento Humano",null,null,null,null,null,null,null,null,null,null,null,null,null,"","",null,null,null,null,null,null,""]
[null,null,null,null,null,null,null,null,null,null,null,null,null,null,null,null,null,null,null,null,null,null,null,null,null,null,null,null,null,null,null,null,null,null,null,null,null,null,null,null,null,null,null,"Dimensión 1. Talento Humano","D_1","Política 2: Integridad (incluye Conflicto de Interés)",null,null,null,null,null,null,null,null,null,null,null,null,null,"","",null,null,null,null,null,null,""]
[null,null,"Proceso SIG",null,null,null,null,null,null,{"$f":"INDEX('PEI-PRELIMINAR'!A6:AI72,MATCH(J12,'PEI-PRELIMINAR'!O6:O74,0),14)","v":{"$error":"#N/A"}},null,null,null,null,null,null,null,null,null,null,null,null,null,null,null,null,null,null,null,null,null,null,null,null,null,null,null,null,null,null,null,null,{"$f":"VLOOKUP(J14,'Base Procesos y Riesgos'!B4:C119,2,FALSE)","v":{"$error":"#N/A"}},"Dimensión 2. Direccionamiento Estratégico y Planeación ","D_2","Política 3: Planeación Institucional (incluye Plan Anticorrupción y de Atención al Ciudadano)",null,null,null,null,null,null,null,null,null,null,null,null,null,"","",null,null,null,null,null,null,""]
[null,null,"Formulación de actividades",null,null,null,null,null,null,null,null,null,null,null,null,null,null,null,null,null,null,null,null,null,null,null,null,null,null,null,null,null,null,null,null,null,null,null,null,null,null,null,null,"Dimensión 2. Direccionamiento Estratégico y Planeación ","D_2","Política 4: Gestión Presupuestal y Eficiencia del Gasto Público",null,null,null,null,null,null,null,null,null,null,null,null,null,"","",null,null,null,null,null,null,""]
[null,null,"Meta Estratégica",null,null,null,null,null,null,null,null,null,null,null,null,null,null,null,null,null,null,null,null,null,null,null,null,null,null,null,null,null,null,null,null,null,null,null,null,null,null,null,null,"Dimensión 3. Gestión con Valores para Resultados","D_3","Política 5: Fortalecimiento Institucional y Simplificación de Procesos",null,null,null,null,null,null,null,null,null,null,null,null,null,"","",null,null,null,null,null,null,""]
[null,null,null,null,null,null,null,null,null,null,null,null,null,null,null,null,null,null,null,null,null,null,null,null,null,null,null,null,null,null,null,null,null,null,null,null,null,null,null,null,null,null,null,"Dimensión 3. Gestión con Valores para Resultados","D_3","Política 6: Gobierno Digital",null,null,null,null,null,null,null,null,null,null,null,null,null,"","",null,null,null,null,null,null,""]
[null,null,"Ponderación de la actividad en la meta estratégica","Nombre de la actividad","Articulación con Proyectos de Inversión",null,null,null,"Entregable","Cantidad Total","Meses de entrega",null,null,null,null,null,null,null,null,null,null,null,"Política MIPG Asociada","Riesgos Asociados",null,"Articulación con otros planes (Decreto 612)",null,null,null,"¿Es una acción de mejora?",null,null,null,null,null,null,null,null,null,null,null,null,null,"Dimensión 3. Gestión con Valores para Resultados","D_3","Política 7: Seguridad Digital",null,null,null,null,null,null,null,null,null,null,null,null,null,"","",null,null,null,null,null,null,""]
[null,null,null,null,"Presupuesto","Proyecto de Inversión","Producto ","Actividad del Proyecto de Inversión",null,null,"Enero ","Febrero","Marzo ","Abril ","Mayo ","Junio ","Julio ","Agosto ","Septiembre","Octubre","Noviembre","Diciembre",null,"Opción 1 Riesgo","Opción 2 Riesgo","Opción 1\nPlan","Opción 2\nPlan","Opción 3\nPlan","Opción 4\nPlan",null,null,null,null,null,null,null,null,null,null,null,null,null,null,"Dimensión 3. Gestión con Valores para Resultados","D_3","Política 8: Defensa Jurídica",null,null,null,null,null,null,null,null,null,null,null,null,null,"","",null,null,null,null,null,null,""]
[null,null,null,null,null,null,null,null,null,{"$f":"SUM(K20:V20)","v":0},null,null,null,null,null,null,null,null,null,null,null,null,null,null,null,null,null,null,null,null,{"$f":"VLOOKUP(F20,Proyecto!$AE$2:$AF$22,2,FALSE)","v":{"$error":"#N/A"}},{"$f":"IF(F20=Proyecto!$AH$1,VLOOKUP(G20,Proyecto!$AH$2:$AI$4,2,FALSE),IF(F20=Proyecto!$AM$1,VLOOKUP(G20,Proyecto!$AM$2:$AN$4,2,FALSE),IF(F20=Proyecto!$AR$1,VLOOKUP(G20,Proyecto!$AR$2:$AS$3,2,FALSE),IF(F20=Proyecto!$AV$1,VLOOKUP(G20,Proyecto!$AV$2:$AW$4,2,FALSE),IF(F20=Proyecto!$BA$1,VLOOKUP(G20,Proyecto!$BA$2:$BB$6,2,FALSE),IF(F20=Proyecto!$BH$1,VLOOKUP(G20,Proyecto!$BH$2:$BI$4,2,FALSE),IF(F20=Proyecto!$BM$1,VLOOKUP(G20,Proyecto!$BM$2:$BN$7,2,FALSE),IF(F20=Proyecto!$BU$1,VLOOKUP(G20,Proyecto!$BU$2:$BV$3,2,FALSE),IF(F20=Proyecto!$BY$1,VLOOKUP(G20,Proyecto!$BY$2:$BZ$4,2,FALSE),IF(F20=Proyecto!$CC$1,VLOOKUP(G20,Proyecto!$CC$2:$CD$2,2,FALSE),IF(F20=Proyecto!$CF$1,VLOOKUP(G20,Proyecto!$CF$2:$CG$3,2,FALSE),IF(F20=Proyecto!$CJ$1,VLOOKUP(G20,Proyecto!$CJ$2:$CK$3,2,FALSE),IF(F20=Proyecto!$CN$1,VLOOKUP(G20,Proyecto!$CN$2:$CO$3,2,FALSE),IF(F20=Proyecto!$CR$1,VLOOKUP(G20,Proyecto!$CR$2:$CS$3,2,FALSE),IF(F20=Proyecto!$CV$1,VLOOKUP(G20,Proyecto!$CV$2:$CW$2,2,FALSE),IF(F20=Proyecto!$CY$1,VLOOKUP(G20,Proyecto!$CY$2:$CZ$4,2,FALSE),IF(F20=Proyecto!$DD$1,VLOOKUP(G20,Proyecto!$DD$2:$DE$8,2,FALSE),IF(F20=Proyecto!$DM$1,VLOOKUP(G20,Proyecto!$DM$2:$DN$3,2,FALSE),IF(F20=Proyecto!$DQ$1,VLOOKUP(G20,Proyecto!$DQ$2:$DR$3,2,FALSE),IF(F20=Proyecto!$DU$1,VLOOKUP(G20,Proyecto!$DU$2:$DV$3,2,FALSE),IF(F20=Proyecto!$DY$1,VLOOKUP(G20,Proyecto!$DY$2:$DZ$2,2,FALSE),\"Nada\")))))))))))))))))))))","v":"Nada"},null,null,null,null,null,null,null,null,null,null,null,"Dimensión 3. Gestión con Valores para Resultados","D_3","Política 17: Mejora Normativa",null,null,null,null,null,null,null,null,null,null,null,null,null,"","",null,null,null,null,null,null,""]
[null,null,null,null,null,null,null,null,null,{"$f":"SUM(K21:V21)","v":0},null,null,null,null,null,null,null,null,null,null,null,null,null,null,null,null,null,null,null,null,{"$f":"VLOOKUP(F21,Proyecto!$AE$2:$AF$22,2,FALSE)","v":{"$error":"#N/A"}},{"$f":"IF(F21=Proyecto!$AH$1,VLOOKUP(G21,Proyecto!$AH$2:$AI$4,2,FALSE),IF(F21=Proyecto!$AM$1,VLOOKUP(G21,Proyecto!$AM$2:$AN$4,2,FALSE),IF(F21=Proyecto!$AR$1,VLOOKUP(G21,Proyecto!$AR$2:$AS$3,2,FALSE),IF(F21=Proyecto!$AV$1,VLOOKUP(G21,Proyecto!$AV$2:$AW$4,2,FALSE),IF(F21=Proyecto!$BA$1,VLOOKUP(G21,Proyecto!$BA$2:$BB$6,2,FALSE),IF(F21=Proyecto!$BH$1,VLOOKUP(G21,Proyecto!$BH$2:$BI$4,2,FALSE),IF(F21=Proyecto!$BM$1,VLOOKUP(G21,Proyecto!$BM$2:$BN$7,2,FALSE),IF(F21=Proyecto!$BU$1,VLOOKUP(G21,Proyecto!$BU$2:$BV$3,2,FALSE),IF(F21=Proyecto!$BY$1,VLOOKUP(G21,Proyecto!$BY$2:$BZ$4,2,FALSE),IF(F21=Proyecto!$CC$1,VLOOKUP(G21,Proyecto!$CC$2:$CD$2,2,FALSE),IF(F21=Proyecto!$CF$1,VLOOKUP(G21,Proyecto!$CF$2:$CG$3,2,FALSE),IF(F21=Proyecto!$CJ$1,VLOOKUP(G21,Proyecto!$CJ$2:$CK$3,2,FALSE),IF(F21=Proyecto!$CN$1,VLOOKUP(G21,Proyecto!$CN$2:$CO$3,2,FALSE),IF(F21=Proyecto!$CR$1,VLOOKUP(G21,Proyecto!$CR$2:$CS$3,2,FALSE),IF(F21=Proyecto!$CV$1,VLOOKUP(G21,Proyecto!$CV$2:$CW$2,2,FALSE),IF(F21=Proyecto!$CY$1,VLOOKUP(G21,Proyecto!$CY$2:$CZ$4,2,FALSE),IF(F21=Proyecto!$DD$1,VLOOKUP(G21,Proyecto!$DD$2:$DE$8,2,FALSE),IF(F21=Proyecto!$DM$1,VLOOKUP(G21,Proyecto!$DM$2:$DN$3,2,FALSE),IF(F21=Proyecto!$DQ$1,VLOOKUP(G21,Proyecto!$DQ$2:$DR$3,2,FALSE),IF(F21=Proyecto!$DU$1,VLOOKUP(G21,Proyecto!$DU$2:$DV$3,2,FALSE),IF(F21=Proyecto!$DY$1,VLOOKUP(G21,Proyecto!$DY$2:$DZ$2,2,FALSE),\"Nada\")))))))))))))))))))))","v":"Nada"},null,null,null,null,null,null,null,null,null,null,null,"Dimensión 3. Gestión con Valores para Resultados","D_3","Política 9: Transparencia, Acceso a la Información y lucha contra la Corrupción",null,null,null,null,null,null,null,null,null,null,null,null,null,"","",null,null,null,null,null,null,""]
[null,null,null,null,null,null,null,null,null,0,null,null,null,null,null,null,null,null,null,null,null,null,null,null,null,null,null,null,null,null,{"$f":"VLOOKUP(F22,Proyecto!$AE$2:$AF$22,2,FALSE)","v":{"$error":"#N/A"}},{"$f":"IF(F22=Proyecto!$AH$1,VLOOKUP(G22,Proyecto!$AH$2:$AI$4,2,FALSE),IF(F22=Proyecto!$AM$1,VLOOKUP(G22,Proyecto!$AM$2:$AN$4,2,FALSE),IF(F22=Proyecto!$AR$1,VLOOKUP(G22,Proyecto!$AR$2:$AS$3,2,FALSE),IF(F22=Proyecto!$AV$1,VLOOKUP(G22,Proyecto!$AV$2:$AW$4,2,FALSE),IF(F22=Proyecto!$BA$1,VLOOKUP(G22,Proyecto!$BA$2:$BB$6,2,FALSE),IF(F22=Proyecto!$BH$1,VLOOKUP(G22,Proyecto!$BH$2:$BI$4,2,FALSE),IF(F22=Proyecto!$BM$1,VLOOKUP(G22,Proyecto!$BM$2:$BN$7,2,FALSE),IF(F22=Proyecto!$BU$1,VLOOKUP(G22,Proyecto!$BU$2:$BV$3,2,FALSE),IF(F22=Proyecto!$BY$1,VLOOKUP(G22,Proyecto!$BY$2:$BZ$4,2,FALSE),IF(F22=Proyecto!$CC$1,VLOOKUP(G22,Proyecto!$CC$2:$CD$2,2,FALSE),IF(F22=Proyecto!$CF$1,VLOOKUP(G22,Proyecto!$CF$2:$CG$3,2,FALSE),IF(F22=Proyecto!$CJ$1,VLOOKUP(G22,Proyecto!$CJ$2:$CK$3,2,FALSE),IF(F22=Proyecto!$CN$1,VLOOKUP(G22,Proyecto!$CN$2:$CO$3,2,FALSE),IF(F22=Proyecto!$CR$1,VLOOKUP(G22,Proyecto!$CR$2:$CS$3,2,FALSE),IF(F22=Proyecto!$CV$1,VLOOKUP(G22,Proyecto!$CV$2:$CW$2,2,FALSE),IF(F22=Proyecto!$CY$1,VLOOKUP(G22,Proyecto!$CY$2:$CZ$4,2,FALSE),IF(F22=Proyecto!$DD$1,VLOOKUP(G22,Proyecto!$DD$2:$DE$8,2,FALSE),IF(F22=Proyecto!$DM$1,VLOOKUP(G22,Proyecto!$DM$2:$DN$3,2,FALSE),IF(F22=Proyecto!$DQ$1,VLOOKUP(G22,Proyecto!$DQ$2:$DR$3,2,FALSE),IF(F22=Proyecto!$DU$1,VLOOKUP(G22,Proyecto!$DU$2:$DV$3,2,FALSE),IF(F22=Proyecto!$DY$1,VLOOKUP(G22,Proyecto!$DY$2:$DZ$2,2,FALSE),\"Nada\")))))))))))))))))))))","v":"Nada"},null,null,null,null,null,null,null,null,null,null,null,"Dimensión 3. Gestión con Valores para Resultados","D_3","Política 10: Servicio al Ciudadano",null,null,null,null,null,null,null,null,null,null,null,null,null,"","",null,null,null,null,null,null,""]
[null,null,null,null,null,null,null,null,null,0,null,null,null,null,null,null,null,null,null,null,null,null,null,null,null,null,null,null,null,null,{"$f":"VLOOKUP(F23,Proyecto!$AE$2:$AF$22,2,FALSE)","v":{"$error":"#N/A"}},{"$f":"IF(F23=Proyecto!$AH$1,VLOOKUP(G23,Proyecto!$AH$2:$AI$4,2,FALSE),IF(F23=Proyecto!$AM$1,VLOOKUP(G23,Proyecto!$AM$2:$AN$4,2,FALSE),IF(F23=Proyecto!$AR$1,VLOOKUP(G23,Proyecto!$AR$2:$AS$3,2,FALSE),IF(F23=Proyecto!$AV$1,VLOOKUP(G23,Proyecto!$AV$2:$AW$4,2,FALSE),IF(F23=Proyecto!$BA$1,VLOOKUP(G23,Proyecto!$BA$2:$BB$6,2,FALSE),IF(F23=Proyecto!$BH$1,VLOOKUP(G23,Proyecto!$BH$2:$BI$4,2,FALSE),IF(F23=Proyecto!$BM$1,VLOOKUP(G23,Proyecto!$BM$2:$BN$7,2,FALSE),IF(F23=Proyecto!$BU$1,VLOOKUP(G23,Proyecto!$BU$2:$BV$3,2,FALSE),IF(F23=Proyecto!$BY$1,VLOOKUP(G23,Proyecto!$BY$2:$BZ$4,2,FALSE),IF(F23=Proyecto!$CC$1,VLOOKUP(G23,Proyecto!$CC$2:$CD$2,2,FALSE),IF(F23=Proyecto!$CF$1,VLOOKUP(G23,Proyecto!$CF$2:$CG$3,2,FALSE),IF(F23=Proyecto!$CJ$1,VLOOKUP(G23,Proyecto!$CJ$2:$CK$3,2,FALSE),IF(F23=Proyecto!$CN$1,VLOOKUP(G23,Proyecto!$CN$2:$CO$3,2,FALSE),IF(F23=Proyecto!$CR$1,VLOOKUP(G23,Proyecto!$CR$2:$CS$3,2,FALSE),IF(F23=Proyecto!$CV$1,VLOOKUP(G23,Proyecto!$CV$2:$CW$2,2,FALSE),IF(F23=Proyecto!$CY$1,VLOOKUP(G23,Proyecto!$CY$2:$CZ$4,2,FALSE),IF(F23=Proyecto!$DD$1,VLOOKUP(G23,Proyecto!$DD$2:$DE$8,2,FALSE),IF(F23=Proyecto!$DM$1,VLOOKUP(G23,Proyecto!$DM$2:$DN$3,2,FALSE),IF(F23=Proyecto!$DQ$1,VLOOKUP(G23,Proyecto!$DQ$2:$DR$3,2,FALSE),IF(F23=Proyecto!$DU$1,VLOOKUP(G23,Proyecto!$DU$2:$DV$3,2,FALSE),IF(F23=Proyecto!$DY$1,VLOOKUP(G23,Proyecto!$DY$2:$DZ$2,2,FALSE),\"Nada\")))))))))))))))))))))","v":"Nada"},null,null,null,null,null,null,null,null,null,null,null,"Dimensión 3. Gestión con Valores para Resultados","D_3","Política 11: Racionalización de Trámites",null,null,null,null,null,null,null,null,null,null,null,null,null,"","",null,null,null,null,null,null,""]
[null,null,null,null,null,null,null,null,null,0,null,null,null,null,null,null,null,null,null,null,null,null,null,null,null,null,null,null,null,null,{"$f":"VLOOKUP(F24,Proyecto!$AE$2:$AF$22,2,FALSE)","v":{"$error":"#N/A"}},{"$f":"IF(F24=Proyecto!$AH$1,VLOOKUP(G24,Proyecto!$AH$2:$AI$4,2,FALSE),IF(F24=Proyecto!$AM$1,VLOOKUP(G24,Proyecto!$AM$2:$AN$4,2,FALSE),IF(F24=Proyecto!$AR$1,VLOOKUP(G24,Proyecto!$AR$2:$AS$3,2,FALSE),IF(F24=Proyecto!$AV$1,VLOOKUP(G24,Proyecto!$AV$2:$AW$4,2,FALSE),IF(F24=Proyecto!$BA$1,VLOOKUP(G24,Proyecto!$BA$2:$BB$6,2,FALSE),IF(F24=Proyecto!$BH$1,VLOOKUP(G24,Proyecto!$BH$2:$BI$4,2,FALSE),IF(F24=Proyecto!$BM$1,VLOOKUP(G24,Proyecto!$BM$2:$BN$7,2,FALSE),IF(F24=Proyecto!$BU$1,VLOOKUP(G24,Proyecto!$BU$2:$BV$3,2,FALSE),IF(F24=Proyecto!$BY$1,VLOOKUP(G24,Proyecto!$BY$2:$BZ$4,2,FALSE),IF(F24=Proyecto!$CC$1,VLOOKUP(G24,Proyecto!$CC$2:$CD$2,2,FALSE),IF(F24=Proyecto!$CF$1,VLOOKUP(G24,Proyecto!$CF$2:$CG$3,2,FALSE),IF(F24=Proyecto!$CJ$1,VLOOKUP(G24,Proyecto!$CJ$2:$CK$3,2,FALSE),IF(F24=Proyecto!$CN$1,VLOOKUP(G24,Proyecto!$CN$2:$CO$3,2,FALSE),IF(F24=Proyecto!$CR$1,VLOOKUP(G24,Proyecto!$CR$2:$CS$3,2,FALSE),IF(F24=Proyecto!$CV$1,VLOOKUP(G24,Proyecto!$CV$2:$CW$2,2,FALSE),IF(F24=Proyecto!$CY$1,VLOOKUP(G24,Proyecto!$CY$2:$CZ$4,2,FALSE),IF(F24=Proyecto!$DD$1,VLOOKUP(G24,Proyecto!$DD$2:$DE$8,2,FALSE),IF(F24=Proyecto!$DM$1,VLOOKUP(G24,Proyecto!$DM$2:$DN$3,2,FALSE),IF(F24=Proyecto!$DQ$1,VLOOKUP(G24,Proyecto!$DQ$2:$DR$3,2,FALSE),IF(F24=Proyecto!$DU$1,VLOOKUP(G24,Proyecto!$DU$2:$DV$3,2,FALSE),IF(F24=Proyecto!$DY$1,VLOOKUP(G24,Proyecto!$DY$2:$DZ$2,2,FALSE),\"Nada\")))))))))))))))))))))","v":"Nada"},null,null,null,null,null,null,null,null,null,null,null,"Dimensión 3. Gestión con Valores para Resultados","D_3","Política 12: Participación Ciudadana en la Gestión Pública (incluye Rendición de Cuentas) ",null,null,null,null,null,null,null,null,null,null,null,null,null,"","",null,null,null,null,null,null,""]
[null,null,null,null,null,null,null,null,null,0,null,null,null,null,null,null,null,null,null,null,null,null,null,null,null,null,null,null,null,null,{"$f":"VLOOKUP(F25,Proyecto!$AE$2:$AF$22,2,FALSE)","v":{"$error":"#N/A"}},{"$f":"IF(F25=Proyecto!$AH$1,VLOOKUP(G25,Proyecto!$AH$2:$AI$4,2,FALSE),IF(F25=Proyecto!$AM$1,VLOOKUP(G25,Proyecto!$AM$2:$AN$4,2,FALSE),IF(F25=Proyecto!$AR$1,VLOOKUP(G25,Proyecto!$AR$2:$AS$3,2,FALSE),IF(F25=Proyecto!$AV$1,VLOOKUP(G25,Proyecto!$AV$2:$AW$4,2,FALSE),IF(F25=Proyecto!$BA$1,VLOOKUP(G25,Proyecto!$BA$2:$BB$6,2,FALSE),IF(F25=Proyecto!$BH$1,VLOOKUP(G25,Proyecto!$BH$2:$BI$4,2,FALSE),IF(F25=Proyecto!$BM$1,VLOOKUP(G25,Proyecto!$BM$2:$BN$7,2,FALSE),IF(F25=Proyecto!$BU$1,VLOOKUP(G25,Proyecto!$BU$2:$BV$3,2,FALSE),IF(F25=Proyecto!$BY$1,VLOOKUP(G25,Proyecto!$BY$2:$BZ$4,2,FALSE),IF(F25=Proyecto!$CC$1,VLOOKUP(G25,Proyecto!$CC$2:$CD$2,2,FALSE),IF(F25=Proyecto!$CF$1,VLOOKUP(G25,Proyecto!$CF$2:$CG$3,2,FALSE),IF(F25=Proyecto!$CJ$1,VLOOKUP(G25,Proyecto!$CJ$2:$CK$3,2,FALSE),IF(F25=Proyecto!$CN$1,VLOOKUP(G25,Proyecto!$CN$2:$CO$3,2,FALSE),IF(F25=Proyecto!$CR$1,VLOOKUP(G25,Proyecto!$CR$2:$CS$3,2,FALSE),IF(F25=Proyecto!$CV$1,VLOOKUP(G25,Proyecto!$CV$2:$CW$2,2,FALSE),IF(F25=Proyecto!$CY$1,VLOOKUP(G25,Proyecto!$CY$2:$CZ$4,2,FALSE),IF(F25=Proyecto!$DD$1,VLOOKUP(G25,Proyecto!$DD$2:$DE$8,2,FALSE),IF(F25=Proyecto!$DM$1,VLOOKUP(G25,Proyecto!$DM$2:$DN$3,2,FALSE),IF(F25=Proyecto!$DQ$1,VLOOKUP(G25,Proyecto!$DQ$2:$DR$3,2,FALSE),IF(F25=Proyecto!$DU$1,VLOOKUP(G25,Proyecto!$DU$2:$DV$3,2,FALSE),IF(F25=Proyecto!$DY$1,VLOOKUP(G25,Proyecto!$DY$2:$DZ$2,2,FALSE),\"Nada\")))))))))))))))))))))","v":"Nada"},null,null,null,null,null,null,null,null,null,null,null,"Dimensión 4. Evaluación de Resultados","D_4","Política 13: Seguimiento y Evaluación del Desempeño Institucional",null,null,null,null,null,null,null,null,null,null,null,null,null,"","",null,null,null,null,null,null,""]
[null,null,null,null,null,null,null,null,null,0,null,null,null,null,null,null,null,null,null,null,null,null,null,null,null,null,null,null,null,null,{"$f":"VLOOKUP(F26,Proyecto!$AE$2:$AF$22,2,FALSE)","v":{"$error":"#N/A"}},{"$f":"IF(F26=Proyecto!$AH$1,VLOOKUP(G26,Proyecto!$AH$2:$AI$4,2,FALSE),IF(F26=Proyecto!$AM$1,VLOOKUP(G26,Proyecto!$AM$2:$AN$4,2,FALSE),IF(F26=Proyecto!$AR$1,VLOOKUP(G26,Proyecto!$AR$2:$AS$3,2,FALSE),IF(F26=Proyecto!$AV$1,VLOOKUP(G26,Proyecto!$AV$2:$AW$4,2,FALSE),IF(F26=Proyecto!$BA$1,VLOOKUP(G26,Proyecto!$BA$2:$BB$6,2,FALSE),IF(F26=Proyecto!$BH$1,VLOOKUP(G26,Proyecto!$BH$2:$BI$4,2,FALSE),IF(F26=Proyecto!$BM$1,VLOOKUP(G26,Proyecto!$BM$2:$BN$7,2,FALSE),IF(F26=Proyecto!$BU$1,VLOOKUP(G26,Proyecto!$BU$2:$BV$3,2,FALSE),IF(F26=Proyecto!$BY$1,VLOOKUP(G26,Proyecto!$BY$2:$BZ$4,2,FALSE),IF(F26=Proyecto!$CC$1,VLOOKUP(G26,Proyecto!$CC$2:$CD$2,2,FALSE),IF(F26=Proyecto!$CF$1,VLOOKUP(G26,Proyecto!$CF$2:$CG$3,2,FALSE),IF(F26=Proyecto!$CJ$1,VLOOKUP(G26,Proyecto!$CJ$2:$CK$3,2,FALSE),IF(F26=Proyecto!$CN$1,VLOOKUP(G26,Proyecto!$CN$2:$CO$3,2,FALSE),IF(F26=Proyecto!$CR$1,VLOOKUP(G26,Proyecto!$CR$2:$CS$3,2,FALSE),IF(F26=Proyecto!$CV$1,VLOOKUP(G26,Proyecto!$CV$2:$CW$2,2,FALSE),IF(F26=Proyecto!$CY$1,VLOOKUP(G26,Proyecto!$CY$2:$CZ$4,2,FALSE),IF(F26=Proyecto!$DD$1,VLOOKUP(G26,Proyecto!$DD$2:$DE$8,2,FALSE),IF(F26=Proyecto!$DM$1,VLOOKUP(G26,Proyecto!$DM$2:$DN$3,2,FALSE),IF(F26=Proyecto!$DQ$1,VLOOKUP(G26,Proyecto!$DQ$2:$DR$3,2,FALSE),IF(F26=Proyecto!$DU$1,VLOOKUP(G26,Proyecto!$DU$2:$DV$3,2,FALSE),IF(F26=Proyecto!$DY$1,VLOOKUP(G26,Proyecto!$DY$2:$DZ$2,2,FALSE),\"Nada\")))))))))))))))))))))","v":"Nada"},null,null,null,null,"                                                                                                                                                                                                                                                                                                                                                                                                                                                                                                                                                                                                                                                                                                                                                                                                                                                                                                                                                                                                                                                                                                                                                                                                                                                                                                                                                                                                                                                                                                                                                                                                                                                                                                                                                                                                                                                                                                                                                                                                                                                                                                                                                                                                                                                                                                                                                                                                                                                                                                                                                                                                                                                                                                                                                                                                                                                                                                                                                                                                                                                                                                                                                                                                                                                                                                                                                                                                                                                                                                                                                                                                                                                                                                                                                                                                                                                                                                                                                                                                                                                                                                                                                                                                                                                                                                                                                                                                                                                                                                                                                                                                                                                                                                                                                                                                                                                                                                                                                                                                                                                                                                                                                                                                                                                                                                                                                                                                                                                                                                                                                                                                                                                                                                                                                                                                                                                                                                                                                                                                                                                                                                                                                                                                                                                                                                                                                                                                                                                                                                                                                                                                                                                                                ",null,null,null,null,null,null,"Dimensión 5.  Información y Comunicación ","D_5","Política 14: Gestión Documental",null,null,null,null,null,null,null,null,null,null,null,null,null,"","",null,null,null,null,null,null,""]
[null,null,null,null,null,null,null,null,null,0,null,null,null,null,null,null,null,null,null,null,null,null,null,null,null,null,null,null,null,null,{"$f":"VLOOKUP(F27,Proyecto!$AE$2:$AF$22,2,FALSE)","v":{"$error":"#N/A"}},{"$f":"IF(F27=Proyecto!$AH$1,VLOOKUP(G27,Proyecto!$AH$2:$AI$4,2,FALSE),IF(F27=Proyecto!$AM$1,VLOOKUP(G27,Proyecto!$AM$2:$AN$4,2,FALSE),IF(F27=Proyecto!$AR$1,VLOOKUP(G27,Proyecto!$AR$2:$AS$3,2,FALSE),IF(F27=Proyecto!$AV$1,VLOOKUP(G27,Proyecto!$AV$2:$AW$4,2,FALSE),IF(F27=Proyecto!$BA$1,VLOOKUP(G27,Proyecto!$BA$2:$BB$6,2,FALSE),IF(F27=Proyecto!$BH$1,VLOOKUP(G27,Proyecto!$BH$2:$BI$4,2,FALSE),IF(F27=Proyecto!$BM$1,VLOOKUP(G27,Proyecto!$BM$2:$BN$7,2,FALSE),IF(F27=Proyecto!$BU$1,VLOOKUP(G27,Proyecto!$BU$2:$BV$3,2,FALSE),IF(F27=Proyecto!$BY$1,VLOOKUP(G27,Proyecto!$BY$2:$BZ$4,2,FALSE),IF(F27=Proyecto!$CC$1,VLOOKUP(G27,Proyecto!$CC$2:$CD$2,2,FALSE),IF(F27=Proyecto!$CF$1,VLOOKUP(G27,Proyecto!$CF$2:$CG$3,2,FALSE),IF(F27=Proyecto!$CJ$1,VLOOKUP(G27,Proyecto!$CJ$2:$CK$3,2,FALSE),IF(F27=Proyecto!$CN$1,VLOOKUP(G27,Proyecto!$CN$2:$CO$3,2,FALSE),IF(F27=Proyecto!$CR$1,VLOOKUP(G27,Proyecto!$CR$2:$CS$3,2,FALSE),IF(F27=Proyecto!$CV$1,VLOOKUP(G27,Proyecto!$CV$2:$CW$2,2,FALSE),IF(F27=Proyecto!$CY$1,VLOOKUP(G27,Proyecto!$CY$2:$CZ$4,2,FALSE),IF(F27=Proyecto!$DD$1,VLOOKUP(G27,Proyecto!$DD$2:$DE$8,2,FALSE),IF(F27=Proyecto!$DM$1,VLOOKUP(G27,Proyecto!$DM$2:$DN$3,2,FALSE),IF(F27=Proyecto!$DQ$1,VLOOKUP(G27,Proyecto!$DQ$2:$DR$3,2,FALSE),IF(F27=Proyecto!$DU$1,VLOOKUP(G27,Proyecto!$DU$2:$DV$3,2,FALSE),IF(F27=Proyecto!$DY$1,VLOOKUP(G27,Proyecto!$DY$2:$DZ$2,2,FALSE),\"Nada\")))))))))))))))))))))","v":"Nada"},null,null,null,null,null,null,null,null,null,null,null,"Dimensión 5.  Información y Comunicación ","D_5","Política 18: Gestión de la Información Estadística",null,null,null,null,null,null,null,null,null,null,null,null,null,"","",null,null,null,null,null,null,""]
[null,null,null,null,null,null,null,null,null,0,null,null,null,null,null,null,null,null,null,null,null,null,null,null,null,null,null,null,null,null,{"$f":"VLOOKUP(F28,Proyecto!$AE$2:$AF$22,2,FALSE)","v":{"$error":"#N/A"}},{"$f":"IF(F28=Proyecto!$AH$1,VLOOKUP(G28,Proyecto!$AH$2:$AI$4,2,FALSE),IF(F28=Proyecto!$AM$1,VLOOKUP(G28,Proyecto!$AM$2:$AN$4,2,FALSE),IF(F28=Proyecto!$AR$1,VLOOKUP(G28,Proyecto!$AR$2:$AS$3,2,FALSE),IF(F28=Proyecto!$AV$1,VLOOKUP(G28,Proyecto!$AV$2:$AW$4,2,FALSE),IF(F28=Proyecto!$BA$1,VLOOKUP(G28,Proyecto!$BA$2:$BB$6,2,FALSE),IF(F28=Proyecto!$BH$1,VLOOKUP(G28,Proyecto!$BH$2:$BI$4,2,FALSE),IF(F28=Proyecto!$BM$1,VLOOKUP(G28,Proyecto!$BM$2:$BN$7,2,FALSE),IF(F28=Proyecto!$BU$1,VLOOKUP(G28,Proyecto!$BU$2:$BV$3,2,FALSE),IF(F28=Proyecto!$BY$1,VLOOKUP(G28,Proyecto!$BY$2:$BZ$4,2,FALSE),IF(F28=Proyecto!$CC$1,VLOOKUP(G28,Proyecto!$CC$2:$CD$2,2,FALSE),IF(F28=Proyecto!$CF$1,VLOOKUP(G28,Proyecto!$CF$2:$CG$3,2,FALSE),IF(F28=Proyecto!$CJ$1,VLOOKUP(G28,Proyecto!$CJ$2:$CK$3,2,FALSE),IF(F28=Proyecto!$CN$1,VLOOKUP(G28,Proyecto!$CN$2:$CO$3,2,FALSE),IF(F28=Proyecto!$CR$1,VLOOKUP(G28,Proyecto!$CR$2:$CS$3,2,FALSE),IF(F28=Proyecto!$CV$1,VLOOKUP(G28,Proyecto!$CV$2:$CW$2,2,FALSE),IF(F28=Proyecto!$CY$1,VLOOKUP(G28,Proyecto!$CY$2:$CZ$4,2,FALSE),IF(F28=Proyecto!$DD$1,VLOOKUP(G28,Proyecto!$DD$2:$DE$8,2,FALSE),IF(F28=Proyecto!$DM$1,VLOOKUP(G28,Proyecto!$DM$2:$DN$3,2,FALSE),IF(F28=Proyecto!$DQ$1,VLOOKUP(G28,Proyecto!$DQ$2:$DR$3,2,FALSE),IF(F28=Proyecto!$DU$1,VLOOKUP(G28,Proyecto!$DU$2:$DV$3,2,FALSE),IF(F28=Proyecto!$DY$1,VLOOKUP(G28,Proyecto!$DY$2:$DZ$2,2,FALSE),\"Nada\")))))))))))))))))))))","v":"Nada"},null,null,null,null,null,null,null,null,null,null,null,"Dimensión 6. Gestión del Conocimiento ","D_6","Política 15: Gestión del conocimiento y la innovación",null,null,null,null,null,null,null,null,null,null,null,null,null,"","",null,null,null,null,null,null,""]
[null,null,null,null,null,null,null,null,null,0,null,null,null,null,null,null,null,null,null,null,null,null,null,null,null,null,null,null,null,null,{"$f":"VLOOKUP(F29,Proyecto!$AE$2:$AF$22,2,FALSE)","v":{"$error":"#N/A"}},{"$f":"IF(F29=Proyecto!$AH$1,VLOOKUP(G29,Proyecto!$AH$2:$AI$4,2,FALSE),IF(F29=Proyecto!$AM$1,VLOOKUP(G29,Proyecto!$AM$2:$AN$4,2,FALSE),IF(F29=Proyecto!$AR$1,VLOOKUP(G29,Proyecto!$AR$2:$AS$3,2,FALSE),IF(F29=Proyecto!$AV$1,VLOOKUP(G29,Proyecto!$AV$2:$AW$4,2,FALSE),IF(F29=Proyecto!$BA$1,VLOOKUP(G29,Proyecto!$BA$2:$BB$6,2,FALSE),IF(F29=Proyecto!$BH$1,VLOOKUP(G29,Proyecto!$BH$2:$BI$4,2,FALSE),IF(F29=Proyecto!$BM$1,VLOOKUP(G29,Proyecto!$BM$2:$BN$7,2,FALSE),IF(F29=Proyecto!$BU$1,VLOOKUP(G29,Proyecto!$BU$2:$BV$3,2,FALSE),IF(F29=Proyecto!$BY$1,VLOOKUP(G29,Proyecto!$BY$2:$BZ$4,2,FALSE),IF(F29=Proyecto!$CC$1,VLOOKUP(G29,Proyecto!$CC$2:$CD$2,2,FALSE),IF(F29=Proyecto!$CF$1,VLOOKUP(G29,Proyecto!$CF$2:$CG$3,2,FALSE),IF(F29=Proyecto!$CJ$1,VLOOKUP(G29,Proyecto!$CJ$2:$CK$3,2,FALSE),IF(F29=Proyecto!$CN$1,VLOOKUP(G29,Proyecto!$CN$2:$CO$3,2,FALSE),IF(F29=Proyecto!$CR$1,VLOOKUP(G29,Proyecto!$CR$2:$CS$3,2,FALSE),IF(F29=Proyecto!$CV$1,VLOOKUP(G29,Proyecto!$CV$2:$CW$2,2,FALSE),IF(F29=Proyecto!$CY$1,VLOOKUP(G29,Proyecto!$CY$2:$CZ$4,2,FALSE),IF(F29=Proyecto!$DD$1,VLOOKUP(G29,Proyecto!$DD$2:$DE$8,2,FALSE),IF(F29=Proyecto!$DM$1,VLOOKUP(G29,Proyecto!$DM$2:$DN$3,2,FALSE),IF(F29=Proyecto!$DQ$1,VLOOKUP(G29,Proyecto!$DQ$2:$DR$3,2,FALSE),IF(F29=Proyecto!$DU$1,VLOOKUP(G29,Proyecto!$DU$2:$DV$3,2,FALSE),IF(F29=Proyecto!$DY$1,VLOOKUP(G29,Proyecto!$DY$2:$DZ$2,2,FALSE),\"Nada\")))))))))))))))))))))","v":"Nada"},null,null,null,null,null,null,null,null,null,null,null,"Dimensión 7. Control Interno","D_7","Política 16: Control Interno",null,null,null,null,null,null,null,null,null,null,null,null,null,"","",null,null,null,null,null,null,""]
[null,null,{"$f":"+SUM(C20:C29)","v":0},null,null,null,null,null,null,null,null,null,null,null,null,null,null,null,null,null,null,null,null,null,null,null,null,null,null,null,null,null,null,null,null,null,null,null,null,null,null,null,null,null,null,null,null,null,null,null,null,null,null,null,null,null,null,null,null,"","",null,null,null,null,null,null,""]
[null,null,null,null,null,null,null,null,null,null,null,null,null,null,null,null,null,null,null,null,null,null,null,null,null,null,null,null,null,null,null,null,null,null,null,null,null,null,null,null,null,null,null,null,null,null,null,null,null,null,null,null,null,null,null,null,null,null,null,"","",null,null,null,null,null,null,""]
[null,null,null,null,null,null,null,null,null,null,null,null,null,null,null,null,null,null,null,null,null,null,null,null,null,null,null,null,null,null,null,null,null,null,null,null,null,null,null,null,null,null,null,null,null,null,null,null,null,null,null,null,null,null,null,null,null,null,null,"","",null,null,null,null,null,null,""]
[null,null,null,null,null,null,null,null,null,null,null,null,null,null,null,null,null,null,null,null,null,null,null,null,null,null,null,null,null,null,null,null,null,null,null,null,null,null,null,null,null,null,null,null,null,null,null,null,null,null,null,null,null,null,null,null,null,null,null,"","",null,null,null,null,null,null,""]
[null,null,null,null,null,null,null,null,null,null,null,null,null,null,null,null,null,null,null,null,null,null,null,null,null,null,null,null,null,null,null,null,null,null,null,null,null,null,null,null,null,null,null,null,null,null,null,null,null,null,null,null,null,null,null,null,null,null,null,"","",null,null,null,null,null,null,""]
[null,null,null,null,null,null,null,null,null,null,null,null,null,null,null,null,null,null,null,null,null,null,null,null,null,null,null,null,null,null,null,null,null,null,null,null,null,null,null,null,null,null,null,null,null,null,null,null,null,null,null,null,null,null,null,null,null,null,null,"","",null,null,null,null,null,null,""]
[null,null,null,null,null,null,null,null,null,null,null,null,null,null,null,null,null,null,null,null,null,null,null,null,null,null,null,null,null,null,null,null,null,null,null,null,null,null,null,null,null,null,null,null,null,null,null,null,null,null,null,null,null,null,null,null,null,null,null,"","",null,null,null,null,null,null,""]
[null,null,null,null,null,null,null,null,null,null,null,null,null,null,null,null,null,null,null,null,null,null,null,null,null,null,null,null,null,null,null,null,null,null,null,null,null,null,null,null,null,null,null,null,null,null,null,null,null,null,null,null,null,null,null,null,null,null,null,"","",null,null,null,null,null,null,""]
[null,null,null,null,null,null,null,null,null,null,null,null,null,null,null,null,null,null,null,null,null,null,null,null,null,null,null,null,null,null,null,null,null,null,null,null,null,null,null,null,null,null,null,null,null,null,null,null,null,null,null,null,null,null,null,null,null,null,null,"","",null,null,null,null,null,null,""]
[null,null,null,null,null,null,null,null,null,null,null,null,null,null,null,null,null,null,null,null,null,null,null,null,null,null,null,null,null,null,null,null,null,null,null,null,null,null,null,null,null,null,null,null,null,null,null,null,null,null,null,null,null,null,null,null,null,null,null,"","",null,null,null,null,null,null,""]
[null,null,null,null,null,null,null,null,null,null,null,null,null,null,null,null,null,null,null,null,null,null,null,null,null,null,null,null,null,null,null,null,null,null,null,null,null,null,null,null,null,null,null,null,null,null,null,null,null,null,null,null,null,null,null,null,null,null,null,"","",null,null,null,null,null,null,""]
[null,null,null,null,null,null,null,null,null,null,null,null,null,null,null,null,null,null,null,null,null,null,null,null,null,null,null,null,null,null,null,null,null,null,null,null,null,null,null,null,null,null,null,null,null,null,null,null,null,null,null,null,null,null,null,null,null,null,null,"","",null,null,null,null,null,null,""]
[null,null,null,null,null,null,null,null,null,null,null,null,null,null,null,null,null,null,null,null,null,null,null,null,null,null,null,null,null,null,null,null,null,null,null,null,null,null,null,null,null,null,null,null,null,null,null,null,null,null,null,null,null,null,null,null,null,null,null,"","",null,null,null,null,null,null,""]
[null,null,null,null,null,null,null,null,null,null,null,null,null,null,null,null,null,null,null,null,null,null,null,null,null,null,null,null,null,null,null,null,null,null,null,null,null,null,null,null,null,null,null,null,null,null,null,null,null,null,null,null,null,null,null,null,null,null,null,"","",null,null,null,null,null,null,""]
[null,null,null,null,null,null,null,null,null,null,null,null,null,null,null,null,null,null,null,null,null,null,null,null,null,null,null,null,null,null,null,null,null,null,null,null,null,null,null,null,null,null,null,null,null,null,null,null,null,null,null,null,null,null,null,null,null,null,null,"","",null,null,null,null,null,null,""]
[null,null,null,null,null,null,null,null,null,null,null,null,null,null,null,null,null,null,null,null,null,null,null,null,null,null,null,null,null,null,null,null,null,null,null,null,null,null,null,null,null,null,null,null,null,null,null,null,null,null,null,null,null,null,null,null,null,null,null,"","",null,null,null,null,null,null,""]
[null,null,null,null,null,null,null,null,null,null,null,null,null,null,null,null,null,null,null,null,null,null,null,null,null,null,null,null,null,null,null,null,null,null,null,null,null,null,null,null,null,null,null,null,null,null,null,null,null,null,null,null,null,null,null,null,null,null,null,"","",null,null,null,null,null,null,""]
[null,null,null,null,null,null,null,null,null,null,null,null,null,null,null,null,null,null,null,null,null,null,null,null,null,null,null,null,null,null,null,null,null,null,null,null,null,null,null,null,null,null,null,null,null,null,null,null,null,null,null,null,null,null,null,null,null,null,null,"","",null,null,null,null,null,null,""]
[null,null,null,null,null,null,null,null,null,null,null,null,null,null,null,null,null,null,null,null,null,null,null,null,null,null,null,null,null,null,null,null,null,null,null,null,null,null,null,null,null,null,null,null,null,null,null,null,null,null,null,null,null,null,null,null,null,null,null,"","",null,null,null,null,null,null,""]
[null,null,null,null,null,null,null,null,null,null,null,null,null,null,null,null,null,null,null,null,null,null,null,null,null,null,null,null,null,null,null,null,null,null,null,null,null,null,null,null,null,null,null,null,null,null,null,null,null,null,null,null,null,null,null,null,null,null,null,"","",null,null,null,null,null,null,""]
[null,null,null,null,null,null,null,null,null,null,null,null,null,null,null,null,null,null,null,null,null,null,null,null,null,null,null,null,null,null,null,null,null,null,null,null,null,null,null,null,null,null,null,null,null,null,null,null,null,null,null,null,null,null,null,null,null,null,null,"","",null,null,null,null,null,null,""]
[null,null,null,null,null,null,null,null,null,null,null,null,null,null,null,null,null,null,null,null,null,null,null,null,null,null,null,null,null,null,null,null,null,null,null,null,null,null,null,null,null,null,null,null,null,null,null,null,null,null,null,null,null,null,null,null,null,null,null,"","",null,null,null,null,null,null,""]
[null,null,null,null,null,null,null,null,null,null,null,null,null,null,null,null,null,null,null,null,null,null,null,null,null,null,null,null,null,null,null,null,null,null,null,null,null,null,null,null,null,null,null,null,null,null,null,null,null,null,null,null,null,null,null,null,null,null,null,"","",null,null,null,null,null,null,""]
[null,null,null,null,null,null,null,null,null,null,null,null,null,null,null,null,null,null,null,null,null,null,null,null,null,null,null,null,null,null,null,null,null,null,null,null,null,null,null,null,null,null,null,null,null,null,null,null,null,null,null,null,null,null,null,null,null,null,null,"","",null,null,null,null,null,null,""]
[null,null,null,null,null,null,null,null,null,null,null,null,null,null,null,null,null,null,null,null,null,null,null,null,null,null,null,null,null,null,null,null,null,null,null,null,null,null,null,null,null,null,null,null,null,null,null,null,null,null,null,null,null,null,null,null,null,null,null,"","",null,null,null,null,null,null,""]
[null,null,null,null,null,null,null,null,null,null,null,null,null,null,null,null,null,null,null,null,null,null,null,null,null,null,null,null,null,null,null,null,null,null,null,null,null,null,null,null,null,null,null,null,null,null,null,null,null,null,null,null,null,null,null,null,null,null,null,"","",null,null,null,null,null,null,""]
[null,null,null,null,null,null,null,null,null,null,null,null,null,null,null,null,null,null,null,null,null,null,null,null,null,null,null,null,null,null,null,null,null,null,null,null,null,null,null,null,null,null,null,null,null,null,null,null,null,null,null,null,null,null,null,null,null,null,null,"","",null,null,null,null,null,null,""]
[null,null,null,null,null,null,null,null,null,null,null,null,null,null,null,null,null,null,null,null,null,null,null,null,null,null,null,null,null,null,null,null,null,null,null,null,null,null,null,null,null,null,null,null,null,null,null,null,null,null,null,null,null,null,null,null,null,null,null,"","",null,null,null,null,null,null,""]
[null,null,null,null,null,null,null,null,null,null,null,null,null,null,null,null,null,null,null,null,null,null,null,null,null,null,null,null,null,null,null,null,null,null,null,null,null,null,null,null,null,null,null,null,null,null,null,null,null,null,null,null,null,null,null,null,null,null,null,"","",null,null,null,null,null,null,""]
[null,null,null,null,null,null,null,null,null,null,null,null,null,null,null,null,null,null,null,null,null,null,null,null,null,null,null,null,null,null,null,null,null,null,null,null,null,null,null,null,null,null,null,null,null,null,null,null,null,null,null,null,null,null,null,null,null,null,null,"","",null,null,null,null,null,null,""]
[null,null,null,null,null,null,null,null,null,null,null,null,null,null,null,null,null,null,null,null,null,null,null,null,null,null,null,null,null,null,null,null,null,null,null,null,null,null,null,null,null,null,null,null,null,null,null,null,null,null,null,null,null,null,null,null,null,null,null,"","",null,null,null,null,null,null,""]
[null,null,null,null,null,null,null,null,null,null,null,null,null,null,null,null,null,null,null,null,null,null,null,null,null,null,null,null,null,null,null,null,null,null,null,null,null,null,null,null,null,null,null,null,null,null,null,null,null,null,null,null,null,null,null,null,null,null,null,"","",null,null,null,null,null,null,""]
[null,null,null,null,null,null,null,null,null,null,null,null,null,null,null,null,null,null,null,null,null,null,null,null,null,null,null,null,null,null,null,null,null,null,null,null,null,null,null,null,null,null,null,null,null,null,null,null,null,null,null,null,null,null,null,null,null,null,null,"","",null,null,null,null,null,null,""]
[null,null,null,null,null,null,null,null,null,null,null,null,null,null,null,null,null,null,null,null,null,null,null,null,null,null,null,null,null,null,null,null,null,null,null,null,null,null,null,null,null,null,null,null,null,null,null,null,null,null,null,null,null,null,null,null,null,null,null,"","",null,null,null,null,null,null,""]
[null,null,null,null,null,null,null,null,null,null,null,null,null,null,null,null,null,null,null,null,null,null,null,null,null,null,null,null,null,null,null,null,null,null,null,null,null,null,null,null,null,null,null,null,null,null,null,null,null,null,null,null,null,null,null,null,null,null,null,"","",null,null,null,null,null,null,""]
[null,null,null,null,null,null,null,null,null,null,null,null,null,null,null,null,null,null,null,null,null,null,null,null,null,null,null,null,null,null,null,null,null,null,null,null,null,null,null,null,null,null,null,null,null,null,null,null,null,null,null,null,null,null,null,null,null,null,null,"","",null,null,null,null,null,null,""]
[null,null,null,null,null,null,null,null,null,null,null,null,null,null,null,null,null,null,null,null,null,null,null,null,null,null,null,null,null,null,null,null,null,null,null,null,null,null,null,null,null,null,null,null,null,null,null,null,null,null,null,null,null,null,null,null,null,null,null,"","",null,null,null,null,null,null,""]
[null,null,null,null,null,null,null,null,null,null,null,null,null,null,null,null,null,null,null,null,null,null,null,null,null,null,null,null,null,null,null,null,null,null,null,null,null,null,null,null,null,null,null,null,null,null,null,null,null,null,null,null,null,null,null,null,null,null,null,"","",null,null,null,null,null,null,""]
[null,null,null,null,null,null,null,null,null,null,null,null,null,null,null,null,null,null,null,null,null,null,null,null,null,null,null,null,null,null,null,null,null,null,null,null,null,null,null,null,null,null,null,null,null,null,null,null,null,null,null,null,null,null,null,null,null,null,null,"","",null,null,null,null,null,null,""]
[null,null,null,null,null,null,null,null,null,null,null,null,null,null,null,null,null,null,null,null,null,null,null,null,null,null,null,null,null,null,null,null,null,null,null,null,null,null,null,null,null,null,null,null,null,null,null,null,null,null,null,null,null,null,null,null,null,null,null,"","",null,null,null,null,null,null,""]
[null,null,null,null,null,null,null,null,null,null,null,null,null,null,null,null,null,null,null,null,null,null,null,null,null,null,null,null,null,null,null,null,null,null,null,null,null,null,null,null,null,null,null,null,null,null,null,null,null,null,null,null,null,null,null,null,null,null,null,"","",null,null,null,null,null,null,""]
[null,null,null,null,null,null,null,null,null,null,null,null,null,null,null,null,null,null,null,null,null,null,null,null,null,null,null,null,null,null,null,null,null,null,null,null,null,null,null,null,null,null,null,null,null,null,null,null,null,null,null,null,null,null,null,null,null,null,null,"","",null,null,null,null,null,null,""]
[null,null,null,null,null,null,null,null,null,null,null,null,null,null,null,null,null,null,null,null,null,null,null,null,null,null,null,null,null,null,null,null,null,null,null,null,null,null,null,null,null,null,null,null,null,null,null,null,null,null,null,null,null,null,null,null,null,null,null,"","",null,null,null,null,null,null,""]
[null,null,null,null,null,null,null,null,null,null,null,null,null,null,null,null,null,null,null,null,null,null,null,null,null,null,null,null,null,null,null,null,null,null,null,null,null,null,null,null,null,null,null,null,null,null,null,null,null,null,null,null,null,null,null,null,null,null,null,"","",null,null,null,null,null,null,""]
[null,null,null,null,null,null,null,null,null,null,null,null,null,null,null,null,null,null,null,null,null,null,null,null,null,null,null,null,null,null,null,null,null,null,null,null,null,null,null,null,null,null,null,null,null,null,null,null,null,null,null,null,null,null,null,null,null,null,null,"","",null,null,null,null,null,null,""]
[null,null,null,null,null,null,null,null,null,null,null,null,null,null,null,null,null,null,null,null,null,null,null,null,null,null,null,null,null,null,null,null,null,null,null,null,null,null,null,null,null,null,null,null,null,null,null,null,null,null,null,null,null,null,null,null,null,null,null,"","",null,null,null,null,null,null,""]
[null,null,null,null,null,null,null,null,null,null,null,null,null,null,null,null,null,null,null,null,null,null,null,null,null,null,null,null,null,null,null,null,null,null,null,null,null,null,null,null,null,null,null,null,null,null,null,null,null,null,null,null,null,null,null,null,null,null,null,"","",null,null,null,null,null,null,""]
[null,null,null,null,null,null,null,null,null,null,null,null,null,null,null,null,null,null,null,null,null,null,null,null,null,null,null,null,null,null,null,null,null,null,null,null,null,null,null,null,null,null,null,null,null,null,null,null,null,null,null,null,null,null,null,null,null,null,null,"","",null,null,null,null,null,null,""]
[null,null,null,null,null,null,null,null,null,null,null,null,null,null,null,null,null,null,null,null,null,null,null,null,null,null,null,null,null,null,null,null,null,null,null,null,null,null,null,null,null,null,null,null,null,null,null,null,null,null,null,null,null,null,null,null,null,null,null,"","",null,null,null,null,null,null,""]
[null,null,null,null,null,null,null,null,null,null,null,null,null,null,null,null,null,null,null,null,null,null,null,null,null,null,null,null,null,null,null,null,null,null,null,null,null,null,null,null,null,null,null,null,null,null,null,null,null,null,null,null,null,null,null,null,null,null,null,"","",null,null,null,null,null,null,""]
[null,null,null,null,null,null,null,null,null,null,null,null,null,null,null,null,null,null,null,null,null,null,null,null,null,null,null,null,null,null,null,null,null,null,null,null,null,null,null,null,null,null,null,null,null,null,null,null,null,null,null,null,null,null,null,null,null,null,null,"","",null,null,null,null,null,null,""]
[null,null,null,null,null,null,null,null,null,null,null,null,null,null,null,null,null,null,null,null,null,null,null,null,null,null,null,null,null,null,null,null,null,null,null,null,null,null,null,null,null,null,null,null,null,null,null,null,null,null,null,null,null,null,null,null,null,null,null,"","",null,null,null,null,null,null,""]
[null,null,null,null,null,null,null,null,null,null,null,null,null,null,null,null,null,null,null,null,null,null,null,null,null,null,null,null,null,null,null,null,null,null,null,null,null,null,null,null,null,null,null,null,null,null,null,null,null,null,null,null,null,null,null,null,null,null,null,"","",null,null,null,null,null,null,""]
[null,null,null,null,null,null,null,null,null,null,null,null,null,null,null,null,null,null,null,null,null,null,null,null,null,null,null,null,null,null,null,null,null,null,null,null,null,null,null,null,null,null,null,null,null,null,null,null,null,null,null,null,null,null,null,null,null,null,null,"","",null,null,null,null,null,null,""]
[null,null,null,null,null,null,null,null,null,null,null,null,null,null,null,null,null,null,null,null,null,null,null,null,null,null,null,null,null,null,null,null,null,null,null,null,null,null,null,null,null,null,null,null,null,null,null,null,null,null,null,null,null,null,null,null,null,null,null,null,null,null,null,null,null,null,null,""]
[null,null,null,null,null,null,null,null,null,null,null,null,null,null,null,null,null,null,null,null,null,null,null,null,null,null,null,null,null,null,null,null,null,null,null,null,null,null,null,null,null,null,null,null,null,null,null,null,null,null,null,null,null,null,null,null,null,null,null,null,null,null,null,null,null,null,null,""]
[null,null,null,null,null,null,null,null,null,null,null,null,null,null,null,null,null,null,null,null,null,null,null,null,null,null,null,null,null,null,null,null,null,null,null,null,null,null,null,null,null,null,null,null,null,null,null,null,null,null,null,null,null,null,null,null,null,null,null,null,null,null,null,null,null,null,null,""]
[null,null,null,null,null,null,null,null,null,null,null,null,null,null,null,null,null,null,null,null,null,null,null,null,null,null,null,null,null,null,null,null,null,null,null,null,null,null,null,null,null,null,null,null,null,null,null,null,null,null,null,null,null,null,null,null,null,null,null,null,null,null,null,null,null,null,null,""]
[null,null,null,null,null,null,null,null,null,null,null,null,null,null,null,null,null,null,null,null,null,null,null,null,null,null,null,null,null,null,null,null,null,null,null,null,null,null,null,null,null,null,null,null,null,null,null,null,null,null,null,null,null,null,null,null,null,null,null,null,null,null,null,null,null,null,null,""]
[null,null,null,null,null,null,null,null,null,null,null,null,null,null,null,null,null,null,null,null,null,null,null,null,null,null,null,null,null,null,null,null,null,null,null,null,null,null,null,null,null,null,null,null,null,null,null,null,null,null,null,null,null,null,null,null,null,null,null,null,null,null,null,null,null,null,null,""]
[null,null,null,null,null,null,null,null,null,null,null,null,null,null,null,null,null,null,null,null,null,null,null,null,null,null,null,null,null,null,null,null,null,null,null,null,null,null,null,null,null,null,null,null,null,null,null,null,null,null,null,null,null,null,null,null,null,null,null,null,null,null,null,null,null,null,null,""]
[null,null,null,null,null,null,null,null,null,null,null,null,null,null,null,null,null,null,null,null,null,null,null,null,null,null,null,null,null,null,null,null,null,null,null,null,null,null,null,null,null,null,null,null,null,null,null,null,null,null,null,null,null,null,null,null,null,null,null,null,null,null,null,null,null,null,null,""]
[null,null,null,null,null,null,null,null,null,null,null,null,null,null,null,null,null,null,null,null,null,null,null,null,null,null,null,null,null,null,null,null,null,null,null,null,null,null,null,null,null,null,null,null,null,null,null,null,null,null,null,null,null,null,null,null,null,null,null,null,null,null,null,null,null,null,null,""]
[null,null,null,null,null,null,null,null,null,null,null,null,null,null,null,null,null,null,null,null,null,null,null,null,null,null,null,null,null,null,null,null,null,null,null,null,null,null,null,null,null,null,null,null,null,null,null,null,null,null,null,null,null,null,null,null,null,null,null,null,null,null,null,null,null,null,null,""]
[null,null,null,null,null,null,null,null,null,null,null,null,null,null,null,null,null,null,null,null,null,null,null,null,null,null,null,null,null,null,null,null,null,null,null,null,null,null,null,null,null,null,null,null,null,null,null,null,null,null,null,null,null,null,null,null,null,null,null,null,null,null,null,null,null,null,null,""]
[null,null,null,null,null,null,null,null,null,null,null,null,null,null,null,null,null,null,null,null,null,null,null,null,null,null,null,null,null,null,null,null,null,null,null,null,null,null,null,null,null,null,null,null,null,null,null,null,null,null,null,null,null,null,null,null,null,null,null,null,null,null,null,null,null,null,null,""]
[null,null,null,null,null,null,null,null,null,null,null,null,null,null,null,null,null,null,null,null,null,null,null,null,null,null,null,null,null,null,null,null,null,null,null,null,null,null,null,null,null,null,null,null,null,null,null,null,null,null,null,null,null,null,null,null,null,null,null,null,null,null,null,null,null,null,null,""]
[null,null,null,null,null,null,null,null,null,null,null,null,null,null,null,null,null,null,null,null,null,null,null,null,null,null,null,null,null,null,null,null,null,null,null,null,null,null,null,null,null,null,null,null,null,null,null,null,null,null,null,null,null,null,null,null,null,null,null,null,null,null,null,null,null,null,null,""]
[null,null,null,null,null,null,null,null,null,null,null,null,null,null,null,null,null,null,null,null,null,null,null,null,null,null,null,null,null,null,null,null,null,null,null,null,null,null,null,null,null,null,null,null,null,null,null,null,null,null,null,null,null,null,null,null,null,null,null,null,null,null,null,null,null,null,null,""]
[null,null,null,null,null,null,null,null,null,null,null,null,null,null,null,null,null,null,null,null,null,null,null,null,null,null,null,null,null,null,null,null,null,null,null,null,null,null,null,null,null,null,null,null,null,null,null,null,null,null,null,null,null,null,null,null,null,null,null,null,null,null,null,null,null,null,null,""]
[null,null,null,null,null,null,null,null,null,null,null,null,null,null,null,null,null,null,null,null,null,null,null,null,null,null,null,null,null,null,null,null,null,null,null,null,null,null,null,null,null,null,null,null,null,null,null,null,null,null,null,null,null,null,null,null,null,null,null,null,null,null,null,null,null,null,null,""]
[null,null,null,null,null,null,null,null,null,null,null,null,null,null,null,null,null,null,null,null,null,null,null,null,null,null,null,null,null,null,null,null,null,null,null,null,null,null,null,null,null,null,null,null,null,null,null,null,null,null,null,null,null,null,null,null,null,null,null,null,null,null,null,null,null,null,null,""]
[null,null,null,null,null,null,null,null,null,null,null,null,null,null,null,null,null,null,null,null,null,null,null,null,null,null,null,null,null,null,null,null,null,null,null,null,null,null,null,null,null,null,null,null,null,null,null,null,null,null,null,null,null,null,null,null,null,null,null,null,null,null,null,null,null,null,null,""]
[null,null,null,null,null,null,null,null,null,null,null,null,null,null,null,null,null,null,null,null,null,null,null,null,null,null,null,null,null,null,null,null,null,null,null,null,null,null,null,null,null,null,null,null,null,null,null,null,null,null,null,null,null,null,null,null,null,null,null,null,null,null,null,null,null,null,null,""]
[null,null,null,null,null,null,null,null,null,null,null,null,null,null,null,null,null,null,null,null,null,null,null,null,null,null,null,null,null,null,null,null,null,null,null,null,null,null,null,null,null,null,null,null,null,null,null,null,null,null,null,null,null,null,null,null,null,null,null,null,null,null,null,null,null,null,null,""]
[null,null,null,null,null,null,null,null,null,null,null,null,null,null,null,null,null,null,null,null,null,null,null,null,null,null,null,null,null,null,null,null,null,null,null,null,null,null,null,null,null,null,null,null,null,null,null,null,null,null,null,null,null,null,null,null,null,null,null,null,null,null,null,null,null,null,null,""]
[null,null,null,null,null,null,null,null,null,null,null,null,null,null,null,null,null,null,null,null,null,null,null,null,null,null,null,null,null,null,null,null,null,null,null,null,null,null,null,null,null,null,null,null,null,null,null,null,null,null,null,null,null,null,null,null,null,null,null,null,null,null,null,null,null,null,null,""]
[null,null,null,null,null,null,null,null,null,null,null,null,null,null,null,null,null,null,null,null,null,null,null,null,null,null,null,null,null,null,null,null,null,null,null,null,null,null,null,null,null,null,null,null,null,null,null,null,null,null,null,null,null,null,null,null,null,null,null,null,null,null,null,null,null,null,null,""]
[null,null,null,null,null,null,null,null,null,null,null,null,null,null,null,null,null,null,null,null,null,null,null,null,null,null,null,null,null,null,null,null,null,null,null,null,null,null,null,null,null,null,null,null,null,null,null,null,null,null,null,null,null,null,null,null,null,null,null,null,null,null,null,null,null,null,null,""]
[null,null,null,null,null,null,null,null,null,null,null,null,null,null,null,null,null,null,null,null,null,null,null,null,null,null,null,null,null,null,null,null,null,null,null,null,null,null,null,null,null,null,null,null,null,null,null,null,null,null,null,null,null,null,null,null,null,null,null,null,null,null,null,null,null,null,null,""]
[null,null,null,null,null,null,null,null,null,null,null,null,null,null,null,null,null,null,null,null,null,null,null,null,null,null,null,null,null,null,null,null,null,null,null,null,null,null,null,null,null,null,null,null,null,null,null,null,null,null,null,null,null,null,null,null,null,null,null,null,null,null,null,null,null,null,null,""]
[null,null,null,null,null,null,null,null,null,null,null,null,null,null,null,null,null,null,null,null,null,null,null,null,null,null,null,null,null,null,null,null,null,null,null,null,null,null,null,null,null,null,null,null,null,null,null,null,null,null,null,null,null,null,null,null,null,null,null,null,null,null,null,null,null,null,null,""]
[null,null,null,null,null,null,null,null,null,null,null,null,null,null,null,null,null,null,null,null,null,null,null,null,null,null,null,null,null,null,null,null,null,null,null,null,null,null,null,null,null,null,null,null,null,null,null,null,null,null,null,null,null,null,null,null,null,null,null,null,null,null,null,null,null,null,null,""]
[null,null,null,null,null,null,null,null,null,null,null,null,null,null,null,null,null,null,null,null,null,null,null,null,null,null,null,null,null,null,null,null,null,null,null,null,null,null,null,null,null,null,null,null,null,null,null,null,null,null,null,null,null,null,null,null,null,null,null,null,null,null,null,null,null,null,null,""]
[null,null,null,null,null,null,null,null,null,null,null,null,null,null,null,null,null,null,null,null,null,null,null,null,null,null,null,null,null,null,null,null,null,null,null,null,null,null,null,null,null,null,null,null,null,null,null,null,null,null,null,null,null,null,null,null,null,null,null,null,null,null,null,null,null,null,null,""]
[null,null,null,null,null,null,null,null,null,null,null,null,null,null,null,null,null,null,null,null,null,null,null,null,null,null,null,null,null,null,null,null,null,null,null,null,null,null,null,null,null,null,null,null,null,null,null,null,null,null,null,null,null,null,null,null,null,null,null,null,null,null,null,null,null,null,null,""]
[null,null,null,null,null,null,null,null,null,null,null,null,null,null,null,null,null,null,null,null,null,null,null,null,null,null,null,null,null,null,null,null,null,null,null,null,null,null,null,null,null,null,null,null,null,null,null,null,null,null,null,null,null,null,null,null,null,null,null,null,null,null,null,null,null,null,null,""]
[null,null,null,null,null,null,null,null,null,null,null,null,null,null,null,null,null,null,null,null,null,null,null,null,null,null,null,null,null,null,null,null,null,null,null,null,null,null,null,null,null,null,null,null,null,null,null,null,null,null,null,null,null,null,null,null,null,null,null,null,null,null,null,null,null,null,null,""]
[null,null,null,null,null,null,null,null,null,null,null,null,null,null,null,null,null,null,null,null,null,null,null,null,null,null,null,null,null,null,null,null,null,null,null,null,null,null,null,null,null,null,null,null,null,null,null,null,null,null,null,null,null,null,null,null,null,null,null,null,null,null,null,null,null,null,null,""]
[null,null,null,null,null,null,null,null,null,null,null,null,null,null,null,null,null,null,null,null,null,null,null,null,null,null,null,null,null,null,null,null,null,null,null,null,null,null,null,null,null,null,null,null,null,null,null,null,null,null,null,null,null,null,null,null,null,null,null,null,null,null,null,null,null,null,null,""]
[null,null,null,null,null,null,null,null,null,null,null,null,null,null,null,null,null,null,null,null,null,null,null,null,null,null,null,null,null,null,null,null,null,null,null,null,null,null,null,null,null,null,null,null,null,null,null,null,null,null,null,null,null,null,null,null,null,null,null,null,null,null,null,null,null,null,null,""]
[null,null,null,null,null,null,null,null,null,null,null,null,null,null,null,null,null,null,null,null,null,null,null,null,null,null,null,null,null,null,null,null,null,null,null,null,null,null,null,null,null,null,null,null,null,null,null,null,null,null,null,null,null,null,null,null,null,null,null,null,null,null,null,null,null,null,null,""]
[null,null,null,null,null,null,null,null,null,null,null,null,null,null,null,null,null,null,null,null,null,null,null,null,null,null,null,null,null,null,null,null,null,null,null,null,null,null,null,null,null,null,null,null,null,null,null,null,null,null,null,null,null,null,null,null,null,null,null,null,null,null,null,null,null,null,null,""]
[null,null,null,null,null,null,null,null,null,null,null,null,null,null,null,null,null,null,null,null,null,null,null,null,null,null,null,null,null,null,null,null,null,null,null,null,null,null,null,null,null,null,null,null,null,null,null,null,null,null,null,null,null,null,null,null,null,null,null,null,null,null,null,null,null,null,null,""]
[null,null,null,null,null,null,null,null,null,null,null,null,null,null,null,null,null,null,null,null,null,null,null,null,null,null,null,null,null,null,null,null,null,null,null,null,null,null,null,null,null,null,null,null,null,null,null,null,null,null,null,null,null,null,null,null,null,null,null,null,null,null,null,null,null,null,null,""]
[null,null,null,null,null,null,null,null,null,null,null,null,null,null,null,null,null,null,null,null,null,null,null,null,null,null,null,null,null,null,null,null,null,null,null,null,null,null,null,null,null,null,null,null,null,null,null,null,null,null,null,null,null,null,null,null,null,null,null,null,null,null,null,null,null,null,null,""]
[null,null,null,null,null,null,null,null,null,null,null,null,null,null,null,null,null,null,null,null,null,null,null,null,null,null,null,null,null,null,null,null,null,null,null,null,null,null,null,null,null,null,null,null,null,null,null,null,null,null,null,null,null,null,null,null,null,null,null,null,null,null,null,null,null,null,null,""]
[null,null,null,null,null,null,null,null,null,null,null,null,null,null,null,null,null,null,null,null,null,null,null,null,null,null,null,null,null,null,null,null,null,null,null,null,null,null,null,null,null,null,null,null,null,null,null,null,null,null,null,null,null,null,null,null,null,null,null,null,null,null,null,null,null,null,null,""]
[null,null,null,null,null,null,null,null,null,null,null,null,null,null,null,null,null,null,null,null,null,null,null,null,null,null,null,null,null,null,null,null,null,null,null,null,null,null,null,null,null,null,null,null,null,null,null,null,null,null,null,null,null,null,null,null,null,null,null,null,null,null,null,null,null,null,null,""]
[null,null,null,null,null,null,null,null,null,null,null,null,null,null,null,null,null,null,null,null,null,null,null,null,null,null,null,null,null,null,null,null,null,null,null,null,null,null,null,null,null,null,null,null,null,null,null,null,null,null,null,null,null,null,null,null,null,null,null,null,null,null,null,null,null,null,null,""]
[null,null,null,null,null,null,null,null,null,null,null,null,null,null,null,null,null,null,null,null,null,null,null,null,null,null,null,null,null,null,null,null,null,null,null,null,null,null,null,null,null,null,null,null,null,null,null,null,null,null,null,null,null,null,null,null,null,null,null,null,null,null,null,null,null,null,null,""]
[null,null,null,null,null,null,null,null,null,null,null,null,null,null,null,null,null,null,null,null,null,null,null,null,null,null,null,null,null,null,null,null,null,null,null,null,null,null,null,null,null,null,null,null,null,null,null,null,null,null,null,null,null,null,null,null,null,null,null,null,null,null,null,null,null,null,null,""]
[null,null,null,null,null,null,null,null,null,null,null,null,null,null,null,null,null,null,null,null,null,null,null,null,null,null,null,null,null,null,null,null,null,null,null,null,null,null,null,null,null,null,null,null,null,null,null,null,null,null,null,null,null,null,null,null,null,null,null,null,null,null,null,null,null,null,null,""]
[null,null,null,null,null,null,null,null,null,null,null,null,null,null,null,null,null,null,null,null,null,null,null,null,null,null,null,null,null,null,null,null,null,null,null,null,null,null,null,null,null,null,null,null,null,null,null,null,null,null,null,null,null,null,null,null,null,null,null,null,null,null,null,null,null,null,null,""]
[null,null,null,null,null,null,null,null,null,null,null,null,null,null,null,null,null,null,null,null,null,null,null,null,null,null,null,null,null,null,null,null,null,null,null,null,null,null,null,null,null,null,null,null,null,null,null,null,null,null,null,null,null,null,null,null,null,null,null,null,null,null,null,null,null,null,null,""]
[null,null,null,null,null,null,null,null,null,null,null,null,null,null,null,null,null,null,null,null,null,null,null,null,null,null,null,null,null,null,null,null,null,null,null,null,null,null,null,null,null,null,null,null,null,null,null,null,null,null,null,null,null,null,null,null,null,null,null,null,null,null,null,null,null,null,null,""]
[null,null,null,null,null,null,null,null,null,null,null,null,null,null,null,null,null,null,null,null,null,null,null,null,null,null,null,null,null,null,null,null,null,null,null,null,null,null,null,null,null,null,null,null,null,null,null,null,null,null,null,null,null,null,null,null,null,null,null,null,null,null,null,null,null,null,null,""]
[null,null,null,null,null,null,null,null,null,null,null,null,null,null,null,null,null,null,null,null,null,null,null,null,null,null,null,null,null,null,null,null,null,null,null,null,null,null,null,null,null,null,null,null,null,null,null,null,null,null,null,null,null,null,null,null,null,null,null,null,null,null,null,null,null,null,null,""]
[null,null,null,null,null,null,null,null,null,null,null,null,null,null,null,null,null,null,null,null,null,null,null,null,null,null,null,null,null,null,null,null,null,null,null,null,null,null,null,null,null,null,null,null,null,null,null,null,null,null,null,null,null,null,null,null,null,null,null,null,null,null,null,null,null,null,null,""]
[null,null,null,null,null,null,null,null,null,null,null,null,null,null,null,null,null,null,null,null,null,null,null,null,null,null,null,null,null,null,null,null,null,null,null,null,null,null,null,null,null,null,null,null,null,null,null,null,null,null,null,null,null,null,null,null,null,null,null,null,null,null,null,null,null,null,null,""]
[null,null,null,null,null,null,null,null,null,null,null,null,null,null,null,null,null,null,null,null,null,null,null,null,null,null,null,null,null,null,null,null,null,null,null,null,null,null,null,null,null,null,null,null,null,null,null,null,null,null,null,null,null,null,null,null,null,null,null,null,null,null,null,null,null,null,null,""]
[null,null,null,null,null,null,null,null,null,null,null,null,null,null,null,null,null,null,null,null,null,null,null,null,null,null,null,null,null,null,null,null,null,null,null,null,null,null,null,null,null,null,null,null,null,null,null,null,null,null,null,null,null,null,null,null,null,null,null,null,null,null,null,null,null,null,null,""]
[null,null,null,null,null,null,null,null,null,null,null,null,null,null,null,null,null,null,null,null,null,null,null,null,null,null,null,null,null,null,null,null,null,null,null,null,null,null,null,null,null,null,null,null,null,null,null,null,null,null,null,null,null,null,null,null,null,null,null,null,null,null,null,null,null,null,null,""]
[null,null,null,null,null,null,null,null,null,null,null,null,null,null,null,null,null,null,null,null,null,null,null,null,null,null,null,null,null,null,null,null,null,null,null,null,null,null,null,null,null,null,null,null,null,null,null,null,null,null,null,null,null,null,null,null,null,null,null,null,null,null,null,null,null,null,null,""]
[null,null,null,null,null,null,null,null,null,null,null,null,null,null,null,null,null,null,null,null,null,null,null,null,null,null,null,null,null,null,null,null,null,null,null,null,null,null,null,null,null,null,null,null,null,null,null,null,null,null,null,null,null,null,null,null,null,null,null,null,null,null,null,null,null,null,null,""]
[null,null,null,null,null,null,null,null,null,null,null,null,null,null,null,null,null,null,null,null,null,null,null,null,null,null,null,null,null,null,null,null,null,null,null,null,null,null,null,null,null,null,null,null,null,null,null,null,null,null,null,null,null,null,null,null,null,null,null,null,null,null,null,null,null,null,null,""]
[null,null,null,null,null,null,null,null,null,null,null,null,null,null,null,null,null,null,null,null,null,null,null,null,null,null,null,null,null,null,null,null,null,null,null,null,null,null,null,null,null,null,null,null,null,null,null,null,null,null,null,null,null,null,null,null,null,null,null,null,null,null,null,null,null,null,null,""]
[null,null,null,null,null,null,null,null,null,null,null,null,null,null,null,null,null,null,null,null,null,null,null,null,null,null,null,null,null,null,null,null,null,null,null,null,null,null,null,null,null,null,null,null,null,null,null,null,null,null,null,null,null,null,null,null,null,null,null,null,null,null,null,null,null,null,null,""]
[null,null,null,null,null,null,null,null,null,null,null,null,null,null,null,null,null,null,null,null,null,null,null,null,null,null,null,null,null,null,null,null,null,null,null,null,null,null,null,null,null,null,null,null,null,null,null,null,null,null,null,null,null,null,null,null,null,null,null,null,null,null,null,null,null,null,null,""]
[null,null,null,null,null,null,null,null,null,null,null,null,null,null,null,null,null,null,null,null,null,null,null,null,null,null,null,null,null,null,null,null,null,null,null,null,null,null,null,null,null,null,null,null,null,null,null,null,null,null,null,null,null,null,null,null,null,null,null,null,null,null,null,null,null,null,null,""]
[null,null,null,null,null,null,null,null,null,null,null,null,null,null,null,null,null,null,null,null,null,null,null,null,null,null,null,null,null,null,null,null,null,null,null,null,null,null,null,null,null,null,null,null,null,null,null,null,null,null,null,null,null,null,null,null,null,null,null,null,null,null,null,null,null,null,null,""]
[null,null,null,null,null,null,null,null,null,null,null,null,null,null,null,null,null,null,null,null,null,null,null,null,null,null,null,null,null,null,null,null,null,null,null,null,null,null,null,null,null,null,null,null,null,null,null,null,null,null,null,null,null,null,null,null,null,null,null,null,null,null,null,null,null,null,null,""]
[null,null,null,null,null,null,null,null,null,null,null,null,null,null,null,null,null,null,null,null,null,null,null,null,null,null,null,null,null,null,null,null,null,null,null,null,null,null,null,null,null,null,null,null,null,null,null,null,null,null,null,null,null,null,null,null,null,null,null,null,null,null,null,null,null,null,null,""]
[null,null,null,null,null,null,null,null,null,null,null,null,null,null,null,null,null,null,null,null,null,null,null,null,null,null,null,null,null,null,null,null,null,null,null,null,null,null,null,null,null,null,null,null,null,null,null,null,null,null,null,null,null,null,null,null,null,null,null,null,null,null,null,null,null,null,null,""]
[null,null,null,null,null,null,null,null,null,null,null,null,null,null,null,null,null,null,null,null,null,null,null,null,null,null,null,null,null,null,null,null,null,null,null,null,null,null,null,null,null,null,null,null,null,null,null,null,null,null,null,null,null,null,null,null,null,null,null,null,null,null,null,null,null,null,null,""]
[null,null,null,null,null,null,null,null,null,null,null,null,null,null,null,null,null,null,null,null,null,null,null,null,null,null,null,null,null,null,null,null,null,null,null,null,null,null,null,null,null,null,null,null,null,null,null,null,null,null,null,null,null,null,null,null,null,null,null,null,null,null,null,null,null,null,null,""]
[null,null,null,null,null,null,null,null,null,null,null,null,null,null,null,null,null,null,null,null,null,null,null,null,null,null,null,null,null,null,null,null,null,null,null,null,null,null,null,null,null,null,null,null,null,null,null,null,null,null,null,null,null,null,null,null,null,null,null,null,null,null,null,null,null,null,null,""]
[null,null,null,null,null,null,null,null,null,null,null,null,null,null,null,null,null,null,null,null,null,null,null,null,null,null,null,null,null,null,null,null,null,null,null,null,null,null,null,null,null,null,null,null,null,null,null,null,null,null,null,null,null,null,null,null,null,null,null,null,null,null,null,null,null,null,null,""]
[null,null,null,null,null,null,null,null,null,null,null,null,null,null,null,null,null,null,null,null,null,null,null,null,null,null,null,null,null,null,null,null,null,null,null,null,null,null,null,null,null,null,null,null,null,null,null,null,null,null,null,null,null,null,null,null,null,null,null,null,null,null,null,null,null,null,null,""]
[null,null,null,null,null,null,null,null,null,null,null,null,null,null,null,null,null,null,null,null,null,null,null,null,null,null,null,null,null,null,null,null,null,null,null,null,null,null,null,null,null,null,null,null,null,null,null,null,null,null,null,null,null,null,null,null,null,null,null,null,null,null,null,null,null,null,null,""]
[null,null,null,null,null,null,null,null,null,null,null,null,null,null,null,null,null,null,null,null,null,null,null,null,null,null,null,null,null,null,null,null,null,null,null,null,null,null,null,null,null,null,null,null,null,null,null,null,null,null,null,null,null,null,null,null,null,null,null,null,null,null,null,null,null,null,null,""]
[null,null,null,null,null,null,null,null,null,null,null,null,null,null,null,null,null,null,null,null,null,null,null,null,null,null,null,null,null,null,null,null,null,null,null,null,null,null,null,null,null,null,null,null,null,null,null,null,null,null,null,null,null,null,null,null,null,null,null,null,null,null,null,null,null,null,null,""]
[null,null,null,null,null,null,null,null,null,null,null,null,null,null,null,null,null,null,null,null,null,null,null,null,null,null,null,null,null,null,null,null,null,null,null,null,null,null,null,null,null,null,null,null,null,null,null,null,null,null,null,null,null,null,null,null,null,null,null,null,null,null,null,null,null,null,null,""]
[null,null,null,null,null,null,null,null,null,null,null,null,null,null,null,null,null,null,null,null,null,null,null,null,null,null,null,null,null,null,null,null,null,null,null,null,null,null,null,null,null,null,null,null,null,null,null,null,null,null,null,null,null,null,null,null,null,null,null,null,null,null,null,null,null,null,null,""]
[null,null,null,null,null,null,null,null,null,null,null,null,null,null,null,null,null,null,null,null,null,null,null,null,null,null,null,null,null,null,null,null,null,null,null,null,null,null,null,null,null,null,null,null,null,null,null,null,null,null,null,null,null,null,null,null,null,null,null,null,null,null,null,null,null,null,null,""]
[null,null,null,null,null,null,null,null,null,null,null,null,null,null,null,null,null,null,null,null,null,null,null,null,null,null,null,null,null,null,null,null,null,null,null,null,null,null,null,null,null,null,null,null,null,null,null,null,null,null,null,null,null,null,null,null,null,null,null,null,null,null,null,null,null,null,null,""]
[null,null,null,null,null,null,null,null,null,null,null,null,null,null,null,null,null,null,null,null,null,null,null,null,null,null,null,null,null,null,null,null,null,null,null,null,null,null,null,null,null,null,null,null,null,null,null,null,null,null,null,null,null,null,null,null,null,null,null,null,null,null,null,null,null,null,null,""]
[null,null,null,null,null,null,null,null,null,null,null,null,null,null,null,null,null,null,null,null,null,null,null,null,null,null,null,null,null,null,null,null,null,null,null,null,null,null,null,null,null,null,null,null,null,null,null,null,null,null,null,null,null,null,null,null,null,null,null,null,null,null,null,null,null,null,null,""]
[null,null,null,null,null,null,null,null,null,null,null,null,null,null,null,null,null,null,null,null,null,null,null,null,null,null,null,null,null,null,null,null,null,null,null,null,null,null,null,null,null,null,null,null,null,null,null,null,null,null,null,null,null,null,null,null,null,null,null,null,null,null,null,null,null,null,null,""]
[null,null,null,null,null,null,null,null,null,null,null,null,null,null,null,null,null,null,null,null,null,null,null,null,null,null,null,null,null,null,null,null,null,null,null,null,null,null,null,null,null,null,null,null,null,null,null,null,null,null,null,null,null,null,null,null,null,null,null,null,null,null,null,null,null,null,null,""]
[null,null,null,null,null,null,null,null,null,null,null,null,null,null,null,null,null,null,null,null,null,null,null,null,null,null,null,null,null,null,null,null,null,null,null,null,null,null,null,null,null,null,null,null,null,null,null,null,null,null,null,null,null,null,null,null,null,null,null,null,null,null,null,null,null,null,null,""]
[null,null,null,null,null,null,null,null,null,null,null,null,null,null,null,null,null,null,null,null,null,null,null,null,null,null,null,null,null,null,null,null,null,null,null,null,null,null,null,null,null,null,null,null,null,null,null,null,null,null,null,null,null,null,null,null,null,null,null,null,null,null,null,null,null,null,null,""]
[null,null,null,null,null,null,null,null,null,null,null,null,null,null,null,null,null,null,null,null,null,null,null,null,null,null,null,null,null,null,null,null,null,null,null,null,null,null,null,null,null,null,null,null,null,null,null,null,null,null,null,null,null,null,null,null,null,null,null,null,null,null,null,null,null,null,null,""]
[null,null,null,null,null,null,null,null,null,null,null,null,null,null,null,null,null,null,null,null,null,null,null,null,null,null,null,null,null,null,null,null,null,null,null,null,null,null,null,null,null,null,null,null,null,null,null,null,null,null,null,null,null,null,null,null,null,null,null,null,null,null,null,null,null,null,null,""]
[null,null,null,null,null,null,null,null,null,null,null,null,null,null,null,null,null,null,null,null,null,null,null,null,null,null,null,null,null,null,null,null,null,null,null,null,null,null,null,null,null,null,null,null,null,null,null,null,null,null,null,null,null,null,null,null,null,null,null,null,null,null,null,null,null,null,null,""]
[null,null,null,null,null,null,null,null,null,null,null,null,null,null,null,null,null,null,null,null,null,null,null,null,null,null,null,null,null,null,null,null,null,null,null,null,null,null,null,null,null,null,null,null,null,null,null,null,null,null,null,null,null,null,null,null,null,null,null,null,null,null,null,null,null,null,null,""]
[null,null,null,null,null,null,null,null,null,null,null,null,null,null,null,null,null,null,null,null,null,null,null,null,null,null,null,null,null,null,null,null,null,null,null,null,null,null,null,null,null,null,null,null,null,null,null,null,null,null,null,null,null,null,null,null,null,null,null,null,null,null,null,null,null,null,null,""]
[null,null,null,null,null,null,null,null,null,null,null,null,null,null,null,null,null,null,null,null,null,null,null,null,null,null,null,null,null,null,null,null,null,null,null,null,null,null,null,null,null,null,null,null,null,null,null,null,null,null,null,null,null,null,null,null,null,null,null,null,null,null,null,null,null,null,null,""]
[null,null,null,null,null,null,null,null,null,null,null,null,null,null,null,null,null,null,null,null,null,null,null,null,null,null,null,null,null,null,null,null,null,null,null,null,null,null,null,null,null,null,null,null,null,null,null,null,null,null,null,null,null,null,null,null,null,null,null,null,null,null,null,null,null,null,null,""]
[null,null,null,null,null,null,null,null,null,null,null,null,null,null,null,null,null,null,null,null,null,null,null,null,null,null,null,null,null,null,null,null,null,null,null,null,null,null,null,null,null,null,null,null,null,null,null,null,null,null,null,null,null,null,null,null,null,null,null,null,null,null,null,null,null,null,null,""]
[null,null,null,null,null,null,null,null,null,null,null,null,null,null,null,null,null,null,null,null,null,null,null,null,null,null,null,null,null,null,null,null,null,null,null,null,null,null,null,null,null,null,null,null,null,null,null,null,null,null,null,null,null,null,null,null,null,null,null,null,null,null,null,null,null,null,null,""]
[null,null,null,null,null,null,null,null,null,null,null,null,null,null,null,null,null,null,null,null,null,null,null,null,null,null,null,null,null,null,null,null,null,null,null,null,null,null,null,null,null,null,null,null,null,null,null,null,null,null,null,null,null,null,null,null,null,null,null,null,null,null,null,null,null,null,null,""]
[null,null,null,null,null,null,null,null,null,null,null,null,null,null,null,null,null,null,null,null,null,null,null,null,null,null,null,null,null,null,null,null,null,null,null,null,null,null,null,null,null,null,null,null,null,null,null,null,null,null,null,null,null,null,null,null,null,null,null,null,null,null,null,null,null,null,null,""]
[null,null,null,null,null,null,null,null,null,null,null,null,null,null,null,null,null,null,null,null,null,null,null,null,null,null,null,null,null,null,null,null,null,null,null,null,null,null,null,null,null,null,null,null,null,null,null,null,null,null,null,null,null,null,null,null,null,null,null,null,null,null,null,null,null,null,null,""]
[null,null,null,null,null,null,null,null,null,null,null,null,null,null,null,null,null,null,null,null,null,null,null,null,null,null,null,null,null,null,null,null,null,null,null,null,null,null,null,null,null,null,null,null,null,null,null,null,null,null,null,null,null,null,null,null,null,null,null,null,null,null,null,null,null,null,null,""]
[null,null,null,null,null,null,null,null,null,null,null,null,null,null,null,null,null,null,null,null,null,null,null,null,null,null,null,null,null,null,null,null,null,null,null,null,null,null,null,null,null,null,null,null,null,null,null,null,null,null,null,null,null,null,null,null,null,null,null,null,null,null,null,null,null,null,null,""]
[null,null,null,null,null,null,null,null,null,null,null,null,null,null,null,null,null,null,null,null,null,null,null,null,null,null,null,null,null,null,null,null,null,null,null,null,null,null,null,null,null,null,null,null,null,null,null,null,null,null,null,null,null,null,null,null,null,null,null,null,null,null,null,null,null,null,null,""]
[null,null,null,null,null,null,null,null,null,null,null,null,null,null,null,null,null,null,null,null,null,null,null,null,null,null,null,null,null,null,null,null,null,null,null,null,null,null,null,null,null,null,null,null,null,null,null,null,null,null,null,null,null,null,null,null,null,null,null,null,null,null,null,null,null,null,null,""]
[null,null,null,null,null,null,null,null,null,null,null,null,null,null,null,null,null,null,null,null,null,null,null,null,null,null,null,null,null,null,null,null,null,null,null,null,null,null,null,null,null,null,null,null,null,null,null,null,null,null,null,null,null,null,null,null,null,null,null,null,null,null,null,null,null,null,null,""]
[null,null,null,null,null,null,null,null,null,null,null,null,null,null,null,null,null,null,null,null,null,null,null,null,null,null,null,null,null,null,null,null,null,null,null,null,null,null,null,null,null,null,null,null,null,null,null,null,null,null,null,null,null,null,null,null,null,null,null,null,null,null,null,null,null,null,null,""]
[null,null,null,null,null,null,null,null,null,null,null,null,null,null,null,null,null,null,null,null,null,null,null,null,null,null,null,null,null,null,null,null,null,null,null,null,null,null,null,null,null,null,null,null,null,null,null,null,null,null,null,null,null,null,null,null,null,null,null,null,null,null,null,null,null,null,null,""]
[null,null,null,null,null,null,null,null,null,null,null,null,null,null,null,null,null,null,null,null,null,null,null,null,null,null,null,null,null,null,null,null,null,null,null,null,null,null,null,null,null,null,null,null,null,null,null,null,null,null,null,null,null,null,null,null,null,null,null,null,null,null,null,null,null,null,null,""]
[null,null,null,null,null,null,null,null,null,null,null,null,null,null,null,null,null,null,null,null,null,null,null,null,null,null,null,null,null,null,null,null,null,null,null,null,null,null,null,null,null,null,null,null,null,null,null,null,null,null,null,null,null,null,null,null,null,null,null,null,null,null,null,null,null,null,null,""]
[null,null,null,null,null,null,null,null,null,null,null,null,null,null,null,null,null,null,null,null,null,null,null,null,null,null,null,null,null,null,null,null,null,null,null,null,null,null,null,null,null,null,null,null,null,null,null,null,null,null,null,null,null,null,null,null,null,null,null,null,null,null,null,null,null,null,null,""]
[null,null,null,null,null,null,null,null,null,null,null,null,null,null,null,null,null,null,null,null,null,null,null,null,null,null,null,null,null,null,null,null,null,null,null,null,null,null,null,null,null,null,null,null,null,null,null,null,null,null,null,null,null,null,null,null,null,null,null,null,null,null,null,null,null,null,null,""]
[null,null,null,null,null,null,null,null,null,null,null,null,null,null,null,null,null,null,null,null,null,null,null,null,null,null,null,null,null,null,null,null,null,null,null,null,null,null,null,null,null,null,null,null,null,null,null,null,null,null,null,null,null,null,null,null,null,null,null,null,null,null,null,null,null,null,null,""]
[null,null,null,null,null,null,null,null,null,null,null,null,null,null,null,null,null,null,null,null,null,null,null,null,null,null,null,null,null,null,null,null,null,null,null,null,null,null,null,null,null,null,null,null,null,null,null,null,null,null,null,null,null,null,null,null,null,null,null,null,null,null,null,null,null,null,null,""]
[null,null,null,null,null,null,null,null,null,null,null,null,null,null,null,null,null,null,null,null,null,null,null,null,null,null,null,null,null,null,null,null,null,null,null,null,null,null,null,null,null,null,null,null,null,null,null,null,null,null,null,null,null,null,null,null,null,null,null,null,null,null,null,null,null,null,null,""]
[null,null,null,null,null,null,null,null,null,null,null,null,null,null,null,null,null,null,null,null,null,null,null,null,null,null,null,null,null,null,null,null,null,null,null,null,null,null,null,null,null,null,null,null,null,null,null,null,null,null,null,null,null,null,null,null,null,null,null,null,null,null,null,null,null,null,null,""]
[null,null,null,null,null,null,null,null,null,null,null,null,null,null,null,null,null,null,null,null,null,null,null,null,null,null,null,null,null,null,null,null,null,null,null,null,null,null,null,null,null,null,null,null,null,null,null,null,null,null,null,null,null,null,null,null,null,null,null,null,null,null,null,null,null,null,null,""]
[null,null,null,null,null,null,null,null,null,null,null,null,null,null,null,null,null,null,null,null,null,null,null,null,null,null,null,null,null,null,null,null,null,null,null,null,null,null,null,null,null,null,null,null,null,null,null,null,null,null,null,null,null,null,null,null,null,null,null,null,null,null,null,null,null,null,null,""]
[null,null,null,null,null,null,null,null,null,null,null,null,null,null,null,null,null,null,null,null,null,null,null,null,null,null,null,null,null,null,null,null,null,null,null,null,null,null,null,null,null,null,null,null,null,null,null,null,null,null,null,null,null,null,null,null,null,null,null,null,null,null,null,null,null,null,null,""]
[null,null,null,null,null,null,null,null,null,null,null,null,null,null,null,null,null,null,null,null,null,null,null,null,null,null,null,null,null,null,null,null,null,null,null,null,null,null,null,null,null,null,null,null,null,null,null,null,null,null,null,null,null,null,null,null,null,null,null,null,null,null,null,null,null,null,null,""]
[null,null,null,null,null,null,null,null,null,null,null,null,null,null,null,null,null,null,null,null,null,null,null,null,null,null,null,null,null,null,null,null,null,null,null,null,null,null,null,null,null,null,null,null,null,null,null,null,null,null,null,null,null,null,null,null,null,null,null,null,null,null,null,null,null,null,null,""]
[null,null,null,null,null,null,null,null,null,null,null,null,null,null,null,null,null,null,null,null,null,null,null,null,null,null,null,null,null,null,null,null,null,null,null,null,null,null,null,null,null,null,null,null,null,null,null,null,null,null,null,null,null,null,null,null,null,null,null,null,null,null,null,null,null,null,null,""]
[null,null,null,null,null,null,null,null,null,null,null,null,null,null,null,null,null,null,null,null,null,null,null,null,null,null,null,null,null,null,null,null,null,null,null,null,null,null,null,null,null,null,null,null,null,null,null,null,null,null,null,null,null,null,null,null,null,null,null,null,null,null,null,null,null,null,null,""]
[null,null,null,null,null,null,null,null,null,null,null,null,null,null,null,null,null,null,null,null,null,null,null,null,null,null,null,null,null,null,null,null,null,null,null,null,null,null,null,null,null,null,null,null,null,null,null,null,null,null,null,null,null,null,null,null,null,null,null,null,null,null,null,null,null,null,null,""]
[null,null,null,null,null,null,null,null,null,null,null,null,null,null,null,null,null,null,null,null,null,null,null,null,null,null,null,null,null,null,null,null,null,null,null,null,null,null,null,null,null,null,null,null,null,null,null,null,null,null,null,null,null,null,null,null,null,null,null,null,null,null,null,null,null,null,null,""]
[null,null,null,null,null,null,null,null,null,null,null,null,null,null,null,null,null,null,null,null,null,null,null,null,null,null,null,null,null,null,null,null,null,null,null,null,null,null,null,null,null,null,null,null,null,null,null,null,null,null,null,null,null,null,null,null,null,null,null,null,null,null,null,null,null,null,null,""]
[null,null,null,null,null,null,null,null,null,null,null,null,null,null,null,null,null,null,null,null,null,null,null,null,null,null,null,null,null,null,null,null,null,null,null,null,null,null,null,null,null,null,null,null,null,null,null,null,null,null,null,null,null,null,null,null,null,null,null,null,null,null,null,null,null,null,null,""]
[null,null,null,null,null,null,null,null,null,null,null,null,null,null,null,null,null,null,null,null,null,null,null,null,null,null,null,null,null,null,null,null,null,null,null,null,null,null,null,null,null,null,null,null,null,null,null,null,null,null,null,null,null,null,null,null,null,null,null,null,null,null,null,null,null,null,null,""]
[null,null,null,null,null,null,null,null,null,null,null,null,null,null,null,null,null,null,null,null,null,null,null,null,null,null,null,null,null,null,null,null,null,null,null,null,null,null,null,null,null,null,null,null,null,null,null,null,null,null,null,null,null,null,null,null,null,null,null,null,null,null,null,null,null,null,null,""]
[null,null,null,null,null,null,null,null,null,null,null,null,null,null,null,null,null,null,null,null,null,null,null,null,null,null,null,null,null,null,null,null,null,null,null,null,null,null,null,null,null,null,null,null,null,null,null,null,null,null,null,null,null,null,null,null,null,null,null,null,null,null,null,null,null,null,null,""]
[null,null,null,null,null,null,null,null,null,null,null,null,null,null,null,null,null,null,null,null,null,null,null,null,null,null,null,null,null,null,null,null,null,null,null,null,null,null,null,null,null,null,null,null,null,null,null,null,null,null,null,null,null,null,null,null,null,null,null,null,null,null,null,null,null,null,null,""]
[null,null,null,null,null,null,null,null,null,null,null,null,null,null,null,null,null,null,null,null,null,null,null,null,null,null,null,null,null,null,null,null,null,null,null,null,null,null,null,null,null,null,null,null,null,null,null,null,null,null,null,null,null,null,null,null,null,null,null,null,null,null,null,null,null,null,null,""]
[null,null,null,null,null,null,null,null,null,null,null,null,null,null,null,null,null,null,null,null,null,null,null,null,null,null,null,null,null,null,null,null,null,null,null,null,null,null,null,null,null,null,null,null,null,null,null,null,null,null,null,null,null,null,null,null,null,null,null,null,null,null,null,null,null,null,null,""]
[null,null,null,null,null,null,null,null,null,null,null,null,null,null,null,null,null,null,null,null,null,null,null,null,null,null,null,null,null,null,null,null,null,null,null,null,null,null,null,null,null,null,null,null,null,null,null,null,null,null,null,null,null,null,null,null,null,null,null,null,null,null,null,null,null,null,null,""]
[null,null,null,null,null,null,null,null,null,null,null,null,null,null,null,null,null,null,null,null,null,null,null,null,null,null,null,null,null,null,null,null,null,null,null,null,null,null,null,null,null,null,null,null,null,null,null,null,null,null,null,null,null,null,null,null,null,null,null,null,null,null,null,null,null,null,null,""]
[null,null,null,null,null,null,null,null,null,null,null,null,null,null,null,null,null,null,null,null,null,null,null,null,null,null,null,null,null,null,null,null,null,null,null,null,null,null,null,null,null,null,null,null,null,null,null,null,null,null,null,null,null,null,null,null,null,null,null,null,null,null,null,null,null,null,null,""]
[null,null,null,null,null,null,null,null,null,null,null,null,null,null,null,null,null,null,null,null,null,null,null,null,null,null,null,null,null,null,null,null,null,null,null,null,null,null,null,null,null,null,null,null,null,null,null,null,null,null,null,null,null,null,null,null,null,null,null,null,null,null,null,null,null,null,null,""]
[null,null,null,null,null,null,null,null,null,null,null,null,null,null,null,null,null,null,null,null,null,null,null,null,null,null,null,null,null,null,null,null,null,null,null,null,null,null,null,null,null,null,null,null,null,null,null,null,null,null,null,null,null,null,null,null,null,null,null,null,null,null,null,null,null,null,null,""]
[null,null,null,null,null,null,null,null,null,null,null,null,null,null,null,null,null,null,null,null,null,null,null,null,null,null,null,null,null,null,null,null,null,null,null,null,null,null,null,null,null,null,null,null,null,null,null,null,null,null,null,null,null,null,null,null,null,null,null,null,null,null,null,null,null,null,null,""]
[null,null,null,null,null,null,null,null,null,null,null,null,null,null,null,null,null,null,null,null,null,null,null,null,null,null,null,null,null,null,null,null,null,null,null,null,null,null,null,null,null,null,null,null,null,null,null,null,null,null,null,null,null,null,null,null,null,null,null,null,null,null,null,null,null,null,null,""]
[null,null,null,null,null,null,null,null,null,null,null,null,null,null,null,null,null,null,null,null,null,null,null,null,null,null,null,null,null,null,null,null,null,null,null,null,null,null,null,null,null,null,null,null,null,null,null,null,null,null,null,null,null,null,null,null,null,null,null,null,null,null,null,null,null,null,null,""]
[null,null,null,null,null,null,null,null,null,null,null,null,null,null,null,null,null,null,null,null,null,null,null,null,null,null,null,null,null,null,null,null,null,null,null,null,null,null,null,null,null,null,null,null,null,null,null,null,null,null,null,null,null,null,null,null,null,null,null,null,null,null,null,null,null,null,null,""]
[null,null,null,null,null,null,null,null,null,null,null,null,null,null,null,null,null,null,null,null,null,null,null,null,null,null,null,null,null,null,null,null,null,null,null,null,null,null,null,null,null,null,null,null,null,null,null,null,null,null,null,null,null,null,null,null,null,null,null,null,null,null,null,null,null,null,null,""]
[null,null,null,null,null,null,null,null,null,null,null,null,null,null,null,null,null,null,null,null,null,null,null,null,null,null,null,null,null,null,null,null,null,null,null,null,null,null,null,null,null,null,null,null,null,null,null,null,null,null,null,null,null,null,null,null,null,null,null,null,null,null,null,null,null,null,null,""]
[null,null,null,null,null,null,null,null,null,null,null,null,null,null,null,null,null,null,null,null,null,null,null,null,null,null,null,null,null,null,null,null,null,null,null,null,null,null,null,null,null,null,null,null,null,null,null,null,null,null,null,null,null,null,null,null,null,null,null,null,null,null,null,null,null,null,null,""]
[null,null,null,null,null,null,null,null,null,null,null,null,null,null,null,null,null,null,null,null,null,null,null,null,null,null,null,null,null,null,null,null,null,null,null,null,null,null,null,null,null,null,null,null,null,null,null,null,null,null,null,null,null,null,null,null,null,null,null,null,null,null,null,null,null,null,null,""]
[null,null,null,null,null,null,null,null,null,null,null,null,null,null,null,null,null,null,null,null,null,null,null,null,null,null,null,null,null,null,null,null,null,null,null,null,null,null,null,null,null,null,null,null,null,null,null,null,null,null,null,null,null,null,null,null,null,null,null,null,null,null,null,null,null,null,null,""]
[null,null,null,null,null,null,null,null,null,null,null,null,null,null,null,null,null,null,null,null,null,null,null,null,null,null,null,null,null,null,null,null,null,null,null,null,null,null,null,null,null,null,null,null,null,null,null,null,null,null,null,null,null,null,null,null,null,null,null,null,null,null,null,null,null,null,null,""]
[null,null,null,null,null,null,null,null,null,null,null,null,null,null,null,null,null,null,null,null,null,null,null,null,null,null,null,null,null,null,null,null,null,null,null,null,null,null,null,null,null,null,null,null,null,null,null,null,null,null,null,null,null,null,null,null,null,null,null,null,null,null,null,null,null,null,null,""]
[null,null,null,null,null,null,null,null,null,null,null,null,null,null,null,null,null,null,null,null,null,null,null,null,null,null,null,null,null,null,null,null,null,null,null,null,null,null,null,null,null,null,null,null,null,null,null,null,null,null,null,null,null,null,null,null,null,null,null,null,null,null,null,null,null,null,null,""]
[null,null,null,null,null,null,null,null,null,null,null,null,null,null,null,null,null,null,null,null,null,null,null,null,null,null,null,null,null,null,null,null,null,null,null,null,null,null,null,null,null,null,null,null,null,null,null,null,null,null,null,null,null,null,null,null,null,null,null,null,null,null,null,null,null,null,null,""]
[null,null,null,null,null,null,null,null,null,null,null,null,null,null,null,null,null,null,null,null,null,null,null,null,null,null,null,null,null,null,null,null,null,null,null,null,null,null,null,null,null,null,null,null,null,null,null,null,null,null,null,null,null,null,null,null,null,null,null,null,null,null,null,null,null,null,null,""]
[null,null,null,null,null,null,null,null,null,null,null,null,null,null,null,null,null,null,null,null,null,null,null,null,null,null,null,null,null,null,null,null,null,null,null,null,null,null,null,null,null,null,null,null,null,null,null,null,null,null,null,null,null,null,null,null,null,null,null,null,null,null,null,null,null,null,null,""]
[null,null,null,null,null,null,null,null,null,null,null,null,null,null,null,null,null,null,null,null,null,null,null,null,null,null,null,null,null,null,null,null,null,null,null,null,null,null,null,null,null,null,null,null,null,null,null,null,null,null,null,null,null,null,null,null,null,null,null,null,null,null,null,null,null,null,null,""]
[null,null,null,null,null,null,null,null,null,null,null,null,null,null,null,null,null,null,null,null,null,null,null,null,null,null,null,null,null,null,null,null,null,null,null,null,null,null,null,null,null,null,null,null,null,null,null,null,null,null,null,null,null,null,null,null,null,null,null,null,null,null,null,null,null,null,null,""]
[null,null,null,null,null,null,null,null,null,null,null,null,null,null,null,null,null,null,null,null,null,null,null,null,null,null,null,null,null,null,null,null,null,null,null,null,null,null,null,null,null,null,null,null,null,null,null,null,null,null,null,null,null,null,null,null,null,null,null,null,null,null,null,null,null,null,null,""]
[null,null,null,null,null,null,null,null,null,null,null,null,null,null,null,null,null,null,null,null,null,null,null,null,null,null,null,null,null,null,null,null,null,null,null,null,null,null,null,null,null,null,null,null,null,null,null,null,null,null,null,null,null,null,null,null,null,null,null,null,null,null,null,null,null,null,null,""]
[null,null,null,null,null,null,null,null,null,null,null,null,null,null,null,null,null,null,null,null,null,null,null,null,null,null,null,null,null,null,null,null,null,null,null,null,null,null,null,null,null,null,null,null,null,null,null,null,null,null,null,null,null,null,null,null,null,null,null,null,null,null,null,null,null,null,null,""]
[null,null,null,null,null,null,null,null,null,null,null,null,null,null,null,null,null,null,null,null,null,null,null,null,null,null,null,null,null,null,null,null,null,null,null,null,null,null,null,null,null,null,null,null,null,null,null,null,null,null,null,null,null,null,null,null,null,null,null,null,null,null,null,null,null,null,null,""]
[null,null,null,null,null,null,null,null,null,null,null,null,null,null,null,null,null,null,null,null,null,null,null,null,null,null,null,null,null,null,null,null,null,null,null,null,null,null,null,null,null,null,null,null,null,null,null,null,null,null,null,null,null,null,null,null,null,null,null,null,null,null,null,null,null,null,null,""]
[null,null,null,null,null,null,null,null,null,null,null,null,null,null,null,null,null,null,null,null,null,null,null,null,null,null,null,null,null,null,null,null,null,null,null,null,null,null,null,null,null,null,null,null,null,null,null,null,null,null,null,null,null,null,null,null,null,null,null,null,null,null,null,null,null,null,null,""]
[null,null,null,null,null,null,null,null,null,null,null,null,null,null,null,null,null,null,null,null,null,null,null,null,null,null,null,null,null,null,null,null,null,null,null,null,null,null,null,null,null,null,null,null,null,null,null,null,null,null,null,null,null,null,null,null,null,null,null,null,null,null,null,null,null,null,null,""]
[null,null,null,null,null,null,null,null,null,null,null,null,null,null,null,null,null,null,null,null,null,null,null,null,null,null,null,null,null,null,null,null,null,null,null,null,null,null,null,null,null,null,null,null,null,null,null,null,null,null,null,null,null,null,null,null,null,null,null,null,null,null,null,null,null,null,null,""]
[null,null,null,null,null,null,null,null,null,null,null,null,null,null,null,null,null,null,null,null,null,null,null,null,null,null,null,null,null,null,null,null,null,null,null,null,null,null,null,null,null,null,null,null,null,null,null,null,null,null,null,null,null,null,null,null,null,null,null,null,null,null,null,null,null,null,null,""]
[null,null,null,null,null,null,null,null,null,null,null,null,null,null,null,null,null,null,null,null,null,null,null,null,null,null,null,null,null,null,null,null,null,null,null,null,null,null,null,null,null,null,null,null,null,null,null,null,null,null,null,null,null,null,null,null,null,null,null,null,null,null,null,null,null,null,null,""]
[null,null,null,null,null,null,null,null,null,null,null,null,null,null,null,null,null,null,null,null,null,null,null,null,null,null,null,null,null,null,null,null,null,null,null,null,null,null,null,null,null,null,null,null,null,null,null,null,null,null,null,null,null,null,null,null,null,null,null,null,null,null,null,null,null,null,null,""]
[null,null,null,null,null,null,null,null,null,null,null,null,null,null,null,null,null,null,null,null,null,null,null,null,null,null,null,null,null,null,null,null,null,null,null,null,null,null,null,null,null,null,null,null,null,null,null,null,null,null,null,null,null,null,null,null,null,null,null,null,null,null,null,null,null,null,null,""]
[null,null,null,null,null,null,null,null,null,null,null,null,null,null,null,null,null,null,null,null,null,null,null,null,null,null,null,null,null,null,null,null,null,null,null,null,null,null,null,null,null,null,null,null,null,null,null,null,null,null,null,null,null,null,null,null,null,null,null,null,null,null,null,null,null,null,null,""]
[null,null,null,null,null,null,null,null,null,null,null,null,null,null,null,null,null,null,null,null,null,null,null,null,null,null,null,null,null,null,null,null,null,null,null,null,null,null,null,null,null,null,null,null,null,null,null,null,null,null,null,null,null,null,null,null,null,null,null,null,null,null,null,null,null,null,null,""]
[null,null,null,null,null,null,null,null,null,null,null,null,null,null,null,null,null,null,null,null,null,null,null,null,null,null,null,null,null,null,null,null,null,null,null,null,null,null,null,null,null,null,null,null,null,null,null,null,null,null,null,null,null,null,null,null,null,null,null,null,null,null,null,null,null,null,null,""]
[null,null,null,null,null,null,null,null,null,null,null,null,null,null,null,null,null,null,null,null,null,null,null,null,null,null,null,null,null,null,null,null,null,null,null,null,null,null,null,null,null,null,null,null,null,null,null,null,null,null,null,null,null,null,null,null,null,null,null,null,null,null,null,null,null,null,null,""]
[null,null,null,null,null,null,null,null,null,null,null,null,null,null,null,null,null,null,null,null,null,null,null,null,null,null,null,null,null,null,null,null,null,null,null,null,null,null,null,null,null,null,null,null,null,null,null,null,null,null,null,null,null,null,null,null,null,null,null,null,null,null,null,null,null,null,null,""]
[null,null,null,null,null,null,null,null,null,null,null,null,null,null,null,null,null,null,null,null,null,null,null,null,null,null,null,null,null,null,null,null,null,null,null,null,null,null,null,null,null,null,null,null,null,null,null,null,null,null,null,null,null,null,null,null,null,null,null,null,null,null,null,null,null,null,null,""]
[null,null,null,null,null,null,null,null,null,null,null,null,null,null,null,null,null,null,null,null,null,null,null,null,null,null,null,null,null,null,null,null,null,null,null,null,null,null,null,null,null,null,null,null,null,null,null,null,null,null,null,null,null,null,null,null,null,null,null,null,null,null,null,null,null,null,null,""]
[null,null,null,null,null,null,null,null,null,null,null,null,null,null,null,null,null,null,null,null,null,null,null,null,null,null,null,null,null,null,null,null,null,null,null,null,null,null,null,null,null,null,null,null,null,null,null,null,null,null,null,null,null,null,null,null,null,null,null,null,null,null,null,null,null,null,null,""]
[null,null,null,null,null,null,null,null,null,null,null,null,null,null,null,null,null,null,null,null,null,null,null,null,null,null,null,null,null,null,null,null,null,null,null,null,null,null,null,null,null,null,null,null,null,null,null,null,null,null,null,null,null,null,null,null,null,null,null,null,null,null,null,null,null,null,null,""]
[null,null,null,null,null,null,null,null,null,null,null,null,null,null,null,null,null,null,null,null,null,null,null,null,null,null,null,null,null,null,null,null,null,null,null,null,null,null,null,null,null,null,null,null,null,null,null,null,null,null,null,null,null,null,null,null,null,null,null,null,null,null,null,null,null,null,null,""]
[null,null,null,null,null,null,null,null,null,null,null,null,null,null,null,null,null,null,null,null,null,null,null,null,null,null,null,null,null,null,null,null,null,null,null,null,null,null,null,null,null,null,null,null,null,null,null,null,null,null,null,null,null,null,null,null,null,null,null,null,null,null,null,null,null,null,null,""]
[null,null,null,null,null,null,null,null,null,null,null,null,null,null,null,null,null,null,null,null,null,null,null,null,null,null,null,null,null,null,null,null,null,null,null,null,null,null,null,null,null,null,null,null,null,null,null,null,null,null,null,null,null,null,null,null,null,null,null,null,null,null,null,null,null,null,null,""]
[null,null,null,null,null,null,null,null,null,null,null,null,null,null,null,null,null,null,null,null,null,null,null,null,null,null,null,null,null,null,null,null,null,null,null,null,null,null,null,null,null,null,null,null,null,null,null,null,null,null,null,null,null,null,null,null,null,null,null,null,null,null,null,null,null,null,null,""]
[null,null,null,null,null,null,null,null,null,null,null,null,null,null,null,null,null,null,null,null,null,null,null,null,null,null,null,null,null,null,null,null,null,null,null,null,null,null,null,null,null,null,null,null,null,null,null,null,null,null,null,null,null,null,null,null,null,null,null,null,null,null,null,null,null,null,null,""]
[null,null,null,null,null,null,null,null,null,null,null,null,null,null,null,null,null,null,null,null,null,null,null,null,null,null,null,null,null,null,null,null,null,null,null,null,null,null,null,null,null,null,null,null,null,null,null,null,null,null,null,null,null,null,null,null,null,null,null,null,null,null,null,null,null,null,null,""]
[null,null,null,null,null,null,null,null,null,null,null,null,null,null,null,null,null,null,null,null,null,null,null,null,null,null,null,null,null,null,null,null,null,null,null,null,null,null,null,null,null,null,null,null,null,null,null,null,null,null,null,null,null,null,null,null,null,null,null,null,null,null,null,null,null,null,null,""]
[null,null,null,null,null,null,null,null,null,null,null,null,null,null,null,null,null,null,null,null,null,null,null,null,null,null,null,null,null,null,null,null,null,null,null,null,null,null,null,null,null,null,null,null,null,null,null,null,null,null,null,null,null,null,null,null,null,null,null,null,null,null,null,null,null,null,null,""]
[null,null,null,null,null,null,null,null,null,null,null,null,null,null,null,null,null,null,null,null,null,null,null,null,null,null,null,null,null,null,null,null,null,null,null,null,null,null,null,null,null,null,null,null,null,null,null,null,null,null,null,null,null,null,null,null,null,null,null,null,null,null,null,null,null,null,null,""]
[null,null,null,null,null,null,null,null,null,null,null,null,null,null,null,null,null,null,null,null,null,null,null,null,null,null,null,null,null,null,null,null,null,null,null,null,null,null,null,null,null,null,null,null,null,null,null,null,null,null,null,null,null,null,null,null,null,null,null,null,null,null,null,null,null,null,null,""]
[null,null,null,null,null,null,null,null,null,null,null,null,null,null,null,null,null,null,null,null,null,null,null,null,null,null,null,null,null,null,null,null,null,null,null,null,null,null,null,null,null,null,null,null,null,null,null,null,null,null,null,null,null,null,null,null,null,null,null,null,null,null,null,null,null,null,null,""]
[null,null,null,null,null,null,null,null,null,null,null,null,null,null,null,null,null,null,null,null,null,null,null,null,null,null,null,null,null,null,null,null,null,null,null,null,null,null,null,null,null,null,null,null,null,null,null,null,null,null,null,null,null,null,null,null,null,null,null,null,null,null,null,null,null,null,null,""]
[null,null,null,null,null,null,null,null,null,null,null,null,null,null,null,null,null,null,null,null,null,null,null,null,null,null,null,null,null,null,null,null,null,null,null,null,null,null,null,null,null,null,null,null,null,null,null,null,null,null,null,null,null,null,null,null,null,null,null,null,null,null,null,null,null,null,null,""]
[null,null,null,null,null,null,null,null,null,null,null,null,null,null,null,null,null,null,null,null,null,null,null,null,null,null,null,null,null,null,null,null,null,null,null,null,null,null,null,null,null,null,null,null,null,null,null,null,null,null,null,null,null,null,null,null,null,null,null,null,null,null,null,null,null,null,null,""]
[null,null,null,null,null,null,null,null,null,null,null,null,null,null,null,null,null,null,null,null,null,null,null,null,null,null,null,null,null,null,null,null,null,null,null,null,null,null,null,null,null,null,null,null,null,null,null,null,null,null,null,null,null,null,null,null,null,null,null,null,null,null,null,null,null,null,null,""]
[null,null,null,null,null,null,null,null,null,null,null,null,null,null,null,null,null,null,null,null,null,null,null,null,null,null,null,null,null,null,null,null,null,null,null,null,null,null,null,null,null,null,null,null,null,null,null,null,null,null,null,null,null,null,null,null,null,null,null,null,null,null,null,null,null,null,null,""]
[null,null,null,null,null,null,null,null,null,null,null,null,null,null,null,null,null,null,null,null,null,null,null,null,null,null,null,null,null,null,null,null,null,null,null,null,null,null,null,null,null,null,null,null,null,null,null,null,null,null,null,null,null,null,null,null,null,null,null,null,null,null,null,null,null,null,null,""]
[null,null,null,null,null,null,null,null,null,null,null,null,null,null,null,null,null,null,null,null,null,null,null,null,null,null,null,null,null,null,null,null,null,null,null,null,null,null,null,null,null,null,null,null,null,null,null,null,null,null,null,null,null,null,null,null,null,null,null,null,null,null,null,null,null,null,null,""]
[null,null,null,null,null,null,null,null,null,null,null,null,null,null,null,null,null,null,null,null,null,null,null,null,null,null,null,null,null,null,null,null,null,null,null,null,null,null,null,null,null,null,null,null,null,null,null,null,null,null,null,null,null,null,null,null,null,null,null,null,null,null,null,null,null,null,null,""]
[null,null,null,null,null,null,null,null,null,null,null,null,null,null,null,null,null,null,null,null,null,null,null,null,null,null,null,null,null,null,null,null,null,null,null,null,null,null,null,null,null,null,null,null,null,null,null,null,null,null,null,null,null,null,null,null,null,null,null,null,null,null,null,null,null,null,null,""]
[null,null,null,null,null,null,null,null,null,null,null,null,null,null,null,null,null,null,null,null,null,null,null,null,null,null,null,null,null,null,null,null,null,null,null,null,null,null,null,null,null,null,null,null,null,null,null,null,null,null,null,null,null,null,null,null,null,null,null,null,null,null,null,null,null,null,null,""]
[null,null,null,null,null,null,null,null,null,null,null,null,null,null,null,null,null,null,null,null,null,null,null,null,null,null,null,null,null,null,null,null,null,null,null,null,null,null,null,null,null,null,null,null,null,null,null,null,null,null,null,null,null,null,null,null,null,null,null,null,null,null,null,null,null,null,null,""]
[null,null,null,null,null,null,null,null,null,null,null,null,null,null,null,null,null,null,null,null,null,null,null,null,null,null,null,null,null,null,null,null,null,null,null,null,null,null,null,null,null,null,null,null,null,null,null,null,null,null,null,null,null,null,null,null,null,null,null,null,null,null,null,null,null,null,null,""]
[null,null,null,null,null,null,null,null,null,null,null,null,null,null,null,null,null,null,null,null,null,null,null,null,null,null,null,null,null,null,null,null,null,null,null,null,null,null,null,null,null,null,null,null,null,null,null,null,null,null,null,null,null,null,null,null,null,null,null,null,null,null,null,null,null,null,null,""]
[null,null,null,null,null,null,null,null,null,null,null,null,null,null,null,null,null,null,null,null,null,null,null,null,null,null,null,null,null,null,null,null,null,null,null,null,null,null,null,null,null,null,null,null,null,null,null,null,null,null,null,null,null,null,null,null,null,null,null,null,null,null,null,null,null,null,null,""]
[null,null,null,null,null,null,null,null,null,null,null,null,null,null,null,null,null,null,null,null,null,null,null,null,null,null,null,null,null,null,null,null,null,null,null,null,null,null,null,null,null,null,null,null,null,null,null,null,null,null,null,null,null,null,null,null,null,null,null,null,null,null,null,null,null,null,null,""]
[null,null,null,null,null,null,null,null,null,null,null,null,null,null,null,null,null,null,null,null,null,null,null,null,null,null,null,null,null,null,null,null,null,null,null,null,null,null,null,null,null,null,null,null,null,null,null,null,null,null,null,null,null,null,null,null,null,null,null,null,null,null,null,null,null,null,null,""]
[null,null,null,null,null,null,null,null,null,null,null,null,null,null,null,null,null,null,null,null,null,null,null,null,null,null,null,null,null,null,null,null,null,null,null,null,null,null,null,null,null,null,null,null,null,null,null,null,null,null,null,null,null,null,null,null,null,null,null,null,null,null,null,null,null,null,null,""]
[null,null,null,null,null,null,null,null,null,null,null,null,null,null,null,null,null,null,null,null,null,null,null,null,null,null,null,null,null,null,null,null,null,null,null,null,null,null,null,null,null,null,null,null,null,null,null,null,null,null,null,null,null,null,null,null,null,null,null,null,null,null,null,null,null,null,null,""]
[null,null,null,null,null,null,null,null,null,null,null,null,null,null,null,null,null,null,null,null,null,null,null,null,null,null,null,null,null,null,null,null,null,null,null,null,null,null,null,null,null,null,null,null,null,null,null,null,null,null,null,null,null,null,null,null,null,null,null,null,null,null,null,null,null,null,null,""]
[null,null,null,null,null,null,null,null,null,null,null,null,null,null,null,null,null,null,null,null,null,null,null,null,null,null,null,null,null,null,null,null,null,null,null,null,null,null,null,null,null,null,null,null,null,null,null,null,null,null,null,null,null,null,null,null,null,null,null,null,null,null,null,null,null,null,null,""]
[null,null,null,null,null,null,null,null,null,null,null,null,null,null,null,null,null,null,null,null,null,null,null,null,null,null,null,null,null,null,null,null,null,null,null,null,null,null,null,null,null,null,null,null,null,null,null,null,null,null,null,null,null,null,null,null,null,null,null,null,null,null,null,null,null,null,null,""]
[null,null,null,null,null,null,null,null,null,null,null,null,null,null,null,null,null,null,null,null,null,null,null,null,null,null,null,null,null,null,null,null,null,null,null,null,null,null,null,null,null,null,null,null,null,null,null,null,null,null,null,null,null,null,null,null,null,null,null,null,null,null,null,null,null,null,null,""]
[null,null,null,null,null,null,null,null,null,null,null,null,null,null,null,null,null,null,null,null,null,null,null,null,null,null,null,null,null,null,null,null,null,null,null,null,null,null,null,null,null,null,null,null,null,null,null,null,null,null,null,null,null,null,null,null,null,null,null,null,null,null,null,null,null,null,null,""]
[null,null,null,null,null,null,null,null,null,null,null,null,null,null,null,null,null,null,null,null,null,null,null,null,null,null,null,null,null,null,null,null,null,null,null,null,null,null,null,null,null,null,null,null,null,null,null,null,null,null,null,null,null,null,null,null,null,null,null,null,null,null,null,null,null,null,null,""]
[null,null,null,null,null,null,null,null,null,null,null,null,null,null,null,null,null,null,null,null,null,null,null,null,null,null,null,null,null,null,null,null,null,null,null,null,null,null,null,null,null,null,null,null,null,null,null,null,null,null,null,null,null,null,null,null,null,null,null,null,null,null,null,null,null,null,null,""]
[null,null,null,null,null,null,null,null,null,null,null,null,null,null,null,null,null,null,null,null,null,null,null,null,null,null,null,null,null,null,null,null,null,null,null,null,null,null,null,null,null,null,null,null,null,null,null,null,null,null,null,null,null,null,null,null,null,null,null,null,null,null,null,null,null,null,null,""]
[null,null,null,null,null,null,null,null,null,null,null,null,null,null,null,null,null,null,null,null,null,null,null,null,null,null,null,null,null,null,null,null,null,null,null,null,null,null,null,null,null,null,null,null,null,null,null,null,null,null,null,null,null,null,null,null,null,null,null,null,null,null,null,null,null,null,null,""]
[null,null,null,null,null,null,null,null,null,null,null,null,null,null,null,null,null,null,null,null,null,null,null,null,null,null,null,null,null,null,null,null,null,null,null,null,null,null,null,null,null,null,null,null,null,null,null,null,null,null,null,null,null,null,null,null,null,null,null,null,null,null,null,null,null,null,null,""]
[null,null,null,null,null,null,null,null,null,null,null,null,null,null,null,null,null,null,null,null,null,null,null,null,null,null,null,null,null,null,null,null,null,null,null,null,null,null,null,null,null,null,null,null,null,null,null,null,null,null,null,null,null,null,null,null,null,null,null,null,null,null,null,null,null,null,null,""]
[null,null,null,null,null,null,null,null,null,null,null,null,null,null,null,null,null,null,null,null,null,null,null,null,null,null,null,null,null,null,null,null,null,null,null,null,null,null,null,null,null,null,null,null,null,null,null,null,null,null,null,null,null,null,null,null,null,null,null,null,null,null,null,null,null,null,null,""]
[null,null,null,null,null,null,null,null,null,null,null,null,null,null,null,null,null,null,null,null,null,null,null,null,null,null,null,null,null,null,null,null,null,null,null,null,null,null,null,null,null,null,null,null,null,null,null,null,null,null,null,null,null,null,null,null,null,null,null,null,null,null,null,null,null,null,null,""]
[null,null,null,null,null,null,null,null,null,null,null,null,null,null,null,null,null,null,null,null,null,null,null,null,null,null,null,null,null,null,null,null,null,null,null,null,null,null,null,null,null,null,null,null,null,null,null,null,null,null,null,null,null,null,null,null,null,null,null,null,null,null,null,null,null,null,null,""]
[null,null,null,null,null,null,null,null,null,null,null,null,null,null,null,null,null,null,null,null,null,null,null,null,null,null,null,null,null,null,null,null,null,null,null,null,null,null,null,null,null,null,null,null,null,null,null,null,null,null,null,null,null,null,null,null,null,null,null,null,null,null,null,null,null,null,null,""]
[null,null,null,null,null,null,null,null,null,null,null,null,null,null,null,null,null,null,null,null,null,null,null,null,null,null,null,null,null,null,null,null,null,null,null,null,null,null,null,null,null,null,null,null,null,null,null,null,null,null,null,null,null,null,null,null,null,null,null,null,null,null,null,null,null,null,null,""]
[null,null,null,null,null,null,null,null,null,null,null,null,null,null,null,null,null,null,null,null,null,null,null,null,null,null,null,null,null,null,null,null,null,null,null,null,null,null,null,null,null,null,null,null,null,null,null,null,null,null,null,null,null,null,null,null,null,null,null,null,null,null,null,null,null,null,null,""]
[null,null,null,null,null,null,null,null,null,null,null,null,null,null,null,null,null,null,null,null,null,null,null,null,null,null,null,null,null,null,null,null,null,null,null,null,null,null,null,null,null,null,null,null,null,null,null,null,null,null,null,null,null,null,null,null,null,null,null,null,null,null,null,null,null,null,null,""]
[null,null,null,null,null,null,null,null,null,null,null,null,null,null,null,null,null,null,null,null,null,null,null,null,null,null,null,null,null,null,null,null,null,null,null,null,null,null,null,null,null,null,null,null,null,null,null,null,null,null,null,null,null,null,null,null,null,null,null,null,null,null,null,null,null,null,null,""]
[null,null,null,null,null,null,null,null,null,null,null,null,null,null,null,null,null,null,null,null,null,null,null,null,null,null,null,null,null,null,null,null,null,null,null,null,null,null,null,null,null,null,null,null,null,null,null,null,null,null,null,null,null,null,null,null,null,null,null,null,null,null,null,null,null,null,null,""]
[null,null,null,null,null,null,null,null,null,null,null,null,null,null,null,null,null,null,null,null,null,null,null,null,null,null,null,null,null,null,null,null,null,null,null,null,null,null,null,null,null,null,null,null,null,null,null,null,null,null,null,null,null,null,null,null,null,null,null,null,null,null,null,null,null,null,null,""]
[null,null,null,null,null,null,null,null,null,null,null,null,null,null,null,null,null,null,null,null,null,null,null,null,null,null,null,null,null,null,null,null,null,null,null,null,null,null,null,null,null,null,null,null,null,null,null,null,null,null,null,null,null,null,null,null,null,null,null,null,null,null,null,null,null,null,null,""]
[null,null,null,null,null,null,null,null,null,null,null,null,null,null,null,null,null,null,null,null,null,null,null,null,null,null,null,null,null,null,null,null,null,null,null,null,null,null,null,null,null,null,null,null,null,null,null,null,null,null,null,null,null,null,null,null,null,null,null,null,null,null,null,null,null,null,null,""]
[null,null,null,null,null,null,null,null,null,null,null,null,null,null,null,null,null,null,null,null,null,null,null,null,null,null,null,null,null,null,null,null,null,null,null,null,null,null,null,null,null,null,null,null,null,null,null,null,null,null,null,null,null,null,null,null,null,null,null,null,null,null,null,null,null,null,null,""]
[null,null,null,null,null,null,null,null,null,null,null,null,null,null,null,null,null,null,null,null,null,null,null,null,null,null,null,null,null,null,null,null,null,null,null,null,null,null,null,null,null,null,null,null,null,null,null,null,null,null,null,null,null,null,null,null,null,null,null,null,null,null,null,null,null,null,null,""]
[null,null,null,null,null,null,null,null,null,null,null,null,null,null,null,null,null,null,null,null,null,null,null,null,null,null,null,null,null,null,null,null,null,null,null,null,null,null,null,null,null,null,null,null,null,null,null,null,null,null,null,null,null,null,null,null,null,null,null,null,null,null,null,null,null,null,null,""]
[null,null,null,null,null,null,null,null,null,null,null,null,null,null,null,null,null,null,null,null,null,null,null,null,null,null,null,null,null,null,null,null,null,null,null,null,null,null,null,null,null,null,null,null,null,null,null,null,null,null,null,null,null,null,null,null,null,null,null,null,null,null,null,null,null,null,null,""]
[null,null,null,null,null,null,null,null,null,null,null,null,null,null,null,null,null,null,null,null,null,null,null,null,null,null,null,null,null,null,null,null,null,null,null,null,null,null,null,null,null,null,null,null,null,null,null,null,null,null,null,null,null,null,null,null,null,null,null,null,null,null,null,null,null,null,null,""]
[null,null,null,null,null,null,null,null,null,null,null,null,null,null,null,null,null,null,null,null,null,null,null,null,null,null,null,null,null,null,null,null,null,null,null,null,null,null,null,null,null,null,null,null,null,null,null,null,null,null,null,null,null,null,null,null,null,null,null,null,null,null,null,null,null,null,null,""]
[null,null,null,null,null,null,null,null,null,null,null,null,null,null,null,null,null,null,null,null,null,null,null,null,null,null,null,null,null,null,null,null,null,null,null,null,null,null,null,null,null,null,null,null,null,null,null,null,null,null,null,null,null,null,null,null,null,null,null,null,null,null,null,null,null,null,null,""]
[null,null,null,null,null,null,null,null,null,null,null,null,null,null,null,null,null,null,null,null,null,null,null,null,null,null,null,null,null,null,null,null,null,null,null,null,null,null,null,null,null,null,null,null,null,null,null,null,null,null,null,null,null,null,null,null,null,null,null,null,null,null,null,null,null,null,null,""]
[null,null,null,null,null,null,null,null,null,null,null,null,null,null,null,null,null,null,null,null,null,null,null,null,null,null,null,null,null,null,null,null,null,null,null,null,null,null,null,null,null,null,null,null,null,null,null,null,null,null,null,null,null,null,null,null,null,null,null,null,null,null,null,null,null,null,null,""]
[null,null,null,null,null,null,null,null,null,null,null,null,null,null,null,null,null,null,null,null,null,null,null,null,null,null,null,null,null,null,null,null,null,null,null,null,null,null,null,null,null,null,null,null,null,null,null,null,null,null,null,null,null,null,null,null,null,null,null,null,null,null,null,null,null,null,null,""]
[null,null,null,null,null,null,null,null,null,null,null,null,null,null,null,null,null,null,null,null,null,null,null,null,null,null,null,null,null,null,null,null,null,null,null,null,null,null,null,null,null,null,null,null,null,null,null,null,null,null,null,null,null,null,null,null,null,null,null,null,null,null,null,null,null,null,null,""]
[null,null,null,null,null,null,null,null,null,null,null,null,null,null,null,null,null,null,null,null,null,null,null,null,null,null,null,null,null,null,null,null,null,null,null,null,null,null,null,null,null,null,null,null,null,null,null,null,null,null,null,null,null,null,null,null,null,null,null,null,null,null,null,null,null,null,null,""]
[null,null,null,null,null,null,null,null,null,null,null,null,null,null,null,null,null,null,null,null,null,null,null,null,null,null,null,null,null,null,null,null,null,null,null,null,null,null,null,null,null,null,null,null,null,null,null,null,null,null,null,null,null,null,null,null,null,null,null,null,null,null,null,null,null,null,null,""]
[null,null,null,null,null,null,null,null,null,null,null,null,null,null,null,null,null,null,null,null,null,null,null,null,null,null,null,null,null,null,null,null,null,null,null,null,null,null,null,null,null,null,null,null,null,null,null,null,null,null,null,null,null,null,null,null,null,null,null,null,null,null,null,null,null,null,null,""]
[null,null,null,null,null,null,null,null,null,null,null,null,null,null,null,null,null,null,null,null,null,null,null,null,null,null,null,null,null,null,null,null,null,null,null,null,null,null,null,null,null,null,null,null,null,null,null,null,null,null,null,null,null,null,null,null,null,null,null,null,null,null,null,null,null,null,null,""]
[null,null,null,null,null,null,null,null,null,null,null,null,null,null,null,null,null,null,null,null,null,null,null,null,null,null,null,null,null,null,null,null,null,null,null,null,null,null,null,null,null,null,null,null,null,null,null,null,null,null,null,null,null,null,null,null,null,null,null,null,null,null,null,null,null,null,null,""]
[null,null,null,null,null,null,null,null,null,null,null,null,null,null,null,null,null,null,null,null,null,null,null,null,null,null,null,null,null,null,null,null,null,null,null,null,null,null,null,null,null,null,null,null,null,null,null,null,null,null,null,null,null,null,null,null,null,null,null,null,null,null,null,null,null,null,null,""]
[null,null,null,null,null,null,null,null,null,null,null,null,null,null,null,null,null,null,null,null,null,null,null,null,null,null,null,null,null,null,null,null,null,null,null,null,null,null,null,null,null,null,null,null,null,null,null,null,null,null,null,null,null,null,null,null,null,null,null,null,null,null,null,null,null,null,null,""]
[null,null,null,null,null,null,null,null,null,null,null,null,null,null,null,null,null,null,null,null,null,null,null,null,null,null,null,null,null,null,null,null,null,null,null,null,null,null,null,null,null,null,null,null,null,null,null,null,null,null,null,null,null,null,null,null,null,null,null,null,null,null,null,null,null,null,null,""]
[null,null,null,null,null,null,null,null,null,null,null,null,null,null,null,null,null,null,null,null,null,null,null,null,null,null,null,null,null,null,null,null,null,null,null,null,null,null,null,null,null,null,null,null,null,null,null,null,null,null,null,null,null,null,null,null,null,null,null,null,null,null,null,null,null,null,null,""]
[null,null,null,null,null,null,null,null,null,null,null,null,null,null,null,null,null,null,null,null,null,null,null,null,null,null,null,null,null,null,null,null,null,null,null,null,null,null,null,null,null,null,null,null,null,null,null,null,null,null,null,null,null,null,null,null,null,null,null,null,null,null,null,null,null,null,null,""]
[null,null,null,null,null,null,null,null,null,null,null,null,null,null,null,null,null,null,null,null,null,null,null,null,null,null,null,null,null,null,null,null,null,null,null,null,null,null,null,null,null,null,null,null,null,null,null,null,null,null,null,null,null,null,null,null,null,null,null,null,null,null,null,null,null,null,null,""]
[null,null,null,null,null,null,null,null,null,null,null,null,null,null,null,null,null,null,null,null,null,null,null,null,null,null,null,null,null,null,null,null,null,null,null,null,null,null,null,null,null,null,null,null,null,null,null,null,null,null,null,null,null,null,null,null,null,null,null,null,null,null,null,null,null,null,null,""]
[null,null,null,null,null,null,null,null,null,null,null,null,null,null,null,null,null,null,null,null,null,null,null,null,null,null,null,null,null,null,null,null,null,null,null,null,null,null,null,null,null,null,null,null,null,null,null,null,null,null,null,null,null,null,null,null,null,null,null,null,null,null,null,null,null,null,null,""]
[null,null,null,null,null,null,null,null,null,null,null,null,null,null,null,null,null,null,null,null,null,null,null,null,null,null,null,null,null,null,null,null,null,null,null,null,null,null,null,null,null,null,null,null,null,null,null,null,null,null,null,null,null,null,null,null,null,null,null,null,null,null,null,null,null,null,null,""]
[null,null,null,null,null,null,null,null,null,null,null,null,null,null,null,null,null,null,null,null,null,null,null,null,null,null,null,null,null,null,null,null,null,null,null,null,null,null,null,null,null,null,null,null,null,null,null,null,null,null,null,null,null,null,null,null,null,null,null,null,null,null,null,null,null,null,null,""]
[null,null,null,null,null,null,null,null,null,null,null,null,null,null,null,null,null,null,null,null,null,null,null,null,null,null,null,null,null,null,null,null,null,null,null,null,null,null,null,null,null,null,null,null,null,null,null,null,null,null,null,null,null,null,null,null,null,null,null,null,null,null,null,null,null,null,null,""]
[null,null,null,null,null,null,null,null,null,null,null,null,null,null,null,null,null,null,null,null,null,null,null,null,null,null,null,null,null,null,null,null,null,null,null,null,null,null,null,null,null,null,null,null,null,null,null,null,null,null,null,null,null,null,null,null,null,null,null,null,null,null,null,null,null,null,null,""]
[null,null,null,null,null,null,null,null,null,null,null,null,null,null,null,null,null,null,null,null,null,null,null,null,null,null,null,null,null,null,null,null,null,null,null,null,null,null,null,null,null,null,null,null,null,null,null,null,null,null,null,null,null,null,null,null,null,null,null,null,null,null,null,null,null,null,null,""]
[null,null,null,null,null,null,null,null,null,null,null,null,null,null,null,null,null,null,null,null,null,null,null,null,null,null,null,null,null,null,null,null,null,null,null,null,null,null,null,null,null,null,null,null,null,null,null,null,null,null,null,null,null,null,null,null,null,null,null,null,null,null,null,null,null,null,null,""]
[null,null,null,null,null,null,null,null,null,null,null,null,null,null,null,null,null,null,null,null,null,null,null,null,null,null,null,null,null,null,null,null,null,null,null,null,null,null,null,null,null,null,null,null,null,null,null,null,null,null,null,null,null,null,null,null,null,null,null,null,null,null,null,null,null,null,null,""]
[null,null,null,null,null,null,null,null,null,null,null,null,null,null,null,null,null,null,null,null,null,null,null,null,null,null,null,null,null,null,null,null,null,null,null,null,null,null,null,null,null,null,null,null,null,null,null,null,null,null,null,null,null,null,null,null,null,null,null,null,null,null,null,null,null,null,null,""]
[null,null,null,null,null,null,null,null,null,null,null,null,null,null,null,null,null,null,null,null,null,null,null,null,null,null,null,null,null,null,null,null,null,null,null,null,null,null,null,null,null,null,null,null,null,null,null,null,null,null,null,null,null,null,null,null,null,null,null,null,null,null,null,null,null,null,null,""]
[null,null,null,null,null,null,null,null,null,null,null,null,null,null,null,null,null,null,null,null,null,null,null,null,null,null,null,null,null,null,null,null,null,null,null,null,null,null,null,null,null,null,null,null,null,null,null,null,null,null,null,null,null,null,null,null,null,null,null,null,null,null,null,null,null,null,null,""]
[null,null,null,null,null,null,null,null,null,null,null,null,null,null,null,null,null,null,null,null,null,null,null,null,null,null,null,null,null,null,null,null,null,null,null,null,null,null,null,null,null,null,null,null,null,null,null,null,null,null,null,null,null,null,null,null,null,null,null,null,null,null,null,null,null,null,null,""]
[null,null,null,null,null,null,null,null,null,null,null,null,null,null,null,null,null,null,null,null,null,null,null,null,null,null,null,null,null,null,null,null,null,null,null,null,null,null,null,null,null,null,null,null,null,null,null,null,null,null,null,null,null,null,null,null,null,null,null,null,null,null,null,null,null,null,null,""]
[null,null,null,null,null,null,null,null,null,null,null,null,null,null,null,null,null,null,null,null,null,null,null,null,null,null,null,null,null,null,null,null,null,null,null,null,null,null,null,null,null,null,null,null,null,null,null,null,null,null,null,null,null,null,null,null,null,null,null,null,null,null,null,null,null,null,null,""]
[null,null,null,null,null,null,null,null,null,null,null,null,null,null,null,null,null,null,null,null,null,null,null,null,null,null,null,null,null,null,null,null,null,null,null,null,null,null,null,null,null,null,null,null,null,null,null,null,null,null,null,null,null,null,null,null,null,null,null,null,null,null,null,null,null,null,null,""]
[null,null,null,null,null,null,null,null,null,null,null,null,null,null,null,null,null,null,null,null,null,null,null,null,null,null,null,null,null,null,null,null,null,null,null,null,null,null,null,null,null,null,null,null,null,null,null,null,null,null,null,null,null,null,null,null,null,null,null,null,null,null,null,null,null,null,null,""]
[null,null,null,null,null,null,null,null,null,null,null,null,null,null,null,null,null,null,null,null,null,null,null,null,null,null,null,null,null,null,null,null,null,null,null,null,null,null,null,null,null,null,null,null,null,null,null,null,null,null,null,null,null,null,null,null,null,null,null,null,null,null,null,null,null,null,null,""]
[null,null,null,null,null,null,null,null,null,null,null,null,null,null,null,null,null,null,null,null,null,null,null,null,null,null,null,null,null,null,null,null,null,null,null,null,null,null,null,null,null,null,null,null,null,null,null,null,null,null,null,null,null,null,null,null,null,null,null,null,null,null,null,null,null,null,null,""]
[null,null,null,null,null,null,null,null,null,null,null,null,null,null,null,null,null,null,null,null,null,null,null,null,null,null,null,null,null,null,null,null,null,null,null,null,null,null,null,null,null,null,null,null,null,null,null,null,null,null,null,null,null,null,null,null,null,null,null,null,null,null,null,null,null,null,null,""]
[null,null,null,null,null,null,null,null,null,null,null,null,null,null,null,null,null,null,null,null,null,null,null,null,null,null,null,null,null,null,null,null,null,null,null,null,null,null,null,null,null,null,null,null,null,null,null,null,null,null,null,null,null,null,null,null,null,null,null,null,null,null,null,null,null,null,null,""]
[null,null,null,null,null,null,null,null,null,null,null,null,null,null,null,null,null,null,null,null,null,null,null,null,null,null,null,null,null,null,null,null,null,null,null,null,null,null,null,null,null,null,null,null,null,null,null,null,null,null,null,null,null,null,null,null,null,null,null,null,null,null,null,null,null,null,null,""]
[null,null,null,null,null,null,null,null,null,null,null,null,null,null,null,null,null,null,null,null,null,null,null,null,null,null,null,null,null,null,null,null,null,null,null,null,null,null,null,null,null,null,null,null,null,null,null,null,null,null,null,null,null,null,null,null,null,null,null,null,null,null,null,null,null,null,null,""]
[null,null,null,null,null,null,null,null,null,null,null,null,null,null,null,null,null,null,null,null,null,null,null,null,null,null,null,null,null,null,null,null,null,null,null,null,null,null,null,null,null,null,null,null,null,null,null,null,null,null,null,null,null,null,null,null,null,null,null,null,null,null,null,null,null,null,null,""]
[null,null,null,null,null,null,null,null,null,null,null,null,null,null,null,null,null,null,null,null,null,null,null,null,null,null,null,null,null,null,null,null,null,null,null,null,null,null,null,null,null,null,null,null,null,null,null,null,null,null,null,null,null,null,null,null,null,null,null,null,null,null,null,null,null,null,null,""]
[null,null,null,null,null,null,null,null,null,null,null,null,null,null,null,null,null,null,null,null,null,null,null,null,null,null,null,null,null,null,null,null,null,null,null,null,null,null,null,null,null,null,null,null,null,null,null,null,null,null,null,null,null,null,null,null,null,null,null,null,null,null,null,null,null,null,null,""]
[null,null,null,null,null,null,null,null,null,null,null,null,null,null,null,null,null,null,null,null,null,null,null,null,null,null,null,null,null,null,null,null,null,null,null,null,null,null,null,null,null,null,null,null,null,null,null,null,null,null,null,null,null,null,null,null,null,null,null,null,null,null,null,null,null,null,null,""]
[null,null,null,null,null,null,null,null,null,null,null,null,null,null,null,null,null,null,null,null,null,null,null,null,null,null,null,null,null,null,null,null,null,null,null,null,null,null,null,null,null,null,null,null,null,null,null,null,null,null,null,null,null,null,null,null,null,null,null,null,null,null,null,null,null,null,null,""]
[null,null,null,null,null,null,null,null,null,null,null,null,null,null,null,null,null,null,null,null,null,null,null,null,null,null,null,null,null,null,null,null,null,null,null,null,null,null,null,null,null,null,null,null,null,null,null,null,null,null,null,null,null,null,null,null,null,null,null,null,null,null,null,null,null,null,null,""]
[null,null,null,null,null,null,null,null,null,null,null,null,null,null,null,null,null,null,null,null,null,null,null,null,null,null,null,null,null,null,null,null,null,null,null,null,null,null,null,null,null,null,null,null,null,null,null,null,null,null,null,null,null,null,null,null,null,null,null,null,null,null,null,null,null,null,null,""]
[null,null,null,null,null,null,null,null,null,null,null,null,null,null,null,null,null,null,null,null,null,null,null,null,null,null,null,null,null,null,null,null,null,null,null,null,null,null,null,null,null,null,null,null,null,null,null,null,null,null,null,null,null,null,null,null,null,null,null,null,null,null,null,null,null,null,null,""]
[null,null,null,null,null,null,null,null,null,null,null,null,null,null,null,null,null,null,null,null,null,null,null,null,null,null,null,null,null,null,null,null,null,null,null,null,null,null,null,null,null,null,null,null,null,null,null,null,null,null,null,null,null,null,null,null,null,null,null,null,null,null,null,null,null,null,null,""]
[null,null,null,null,null,null,null,null,null,null,null,null,null,null,null,null,null,null,null,null,null,null,null,null,null,null,null,null,null,null,null,null,null,null,null,null,null,null,null,null,null,null,null,null,null,null,null,null,null,null,null,null,null,null,null,null,null,null,null,null,null,null,null,null,null,null,null,""]
[null,null,null,null,null,null,null,null,null,null,null,null,null,null,null,null,null,null,null,null,null,null,null,null,null,null,null,null,null,null,null,null,null,null,null,null,null,null,null,null,null,null,null,null,null,null,null,null,null,null,null,null,null,null,null,null,null,null,null,null,null,null,null,null,null,null,null,""]
[null,null,null,null,null,null,null,null,null,null,null,null,null,null,null,null,null,null,null,null,null,null,null,null,null,null,null,null,null,null,null,null,null,null,null,null,null,null,null,null,null,null,null,null,null,null,null,null,null,null,null,null,null,null,null,null,null,null,null,null,null,null,null,null,null,null,null,""]
[null,null,null,null,null,null,null,null,null,null,null,null,null,null,null,null,null,null,null,null,null,null,null,null,null,null,null,null,null,null,null,null,null,null,null,null,null,null,null,null,null,null,null,null,null,null,null,null,null,null,null,null,null,null,null,null,null,null,null,null,null,null,null,null,null,null,null,""]
[null,null,null,null,null,null,null,null,null,null,null,null,null,null,null,null,null,null,null,null,null,null,null,null,null,null,null,null,null,null,null,null,null,null,null,null,null,null,null,null,null,null,null,null,null,null,null,null,null,null,null,null,null,null,null,null,null,null,null,null,null,null,null,null,null,null,null,""]
[null,null,null,null,null,null,null,null,null,null,null,null,null,null,null,null,null,null,null,null,null,null,null,null,null,null,null,null,null,null,null,null,null,null,null,null,null,null,null,null,null,null,null,null,null,null,null,null,null,null,null,null,null,null,null,null,null,null,null,null,null,null,null,null,null,null,null,""]
[null,null,null,null,null,null,null,null,null,null,null,null,null,null,null,null,null,null,null,null,null,null,null,null,null,null,null,null,null,null,null,null,null,null,null,null,null,null,null,null,null,null,null,null,null,null,null,null,null,null,null,null,null,null,null,null,null,null,null,null,null,null,null,null,null,null,null,""]
[null,null,null,null,null,null,null,null,null,null,null,null,null,null,null,null,null,null,null,null,null,null,null,null,null,null,null,null,null,null,null,null,null,null,null,null,null,null,null,null,null,null,null,null,null,null,null,null,null,null,null,null,null,null,null,null,null,null,null,null,null,null,null,null,null,null,null,""]
[null,null,null,null,null,null,null,null,null,null,null,null,null,null,null,null,null,null,null,null,null,null,null,null,null,null,null,null,null,null,null,null,null,null,null,null,null,null,null,null,null,null,null,null,null,null,null,null,null,null,null,null,null,null,null,null,null,null,null,null,null,null,null,null,null,null,null,""]
[null,null,null,null,null,null,null,null,null,null,null,null,null,null,null,null,null,null,null,null,null,null,null,null,null,null,null,null,null,null,null,null,null,null,null,null,null,null,null,null,null,null,null,null,null,null,null,null,null,null,null,null,null,null,null,null,null,null,null,null,null,null,null,null,null,null,null,""]
[null,null,null,null,null,null,null,null,null,null,null,null,null,null,null,null,null,null,null,null,null,null,null,null,null,null,null,null,null,null,null,null,null,null,null,null,null,null,null,null,null,null,null,null,null,null,null,null,null,null,null,null,null,null,null,null,null,null,null,null,null,null,null,null,null,null,null,""]
[null,null,null,null,null,null,null,null,null,null,null,null,null,null,null,null,null,null,null,null,null,null,null,null,null,null,null,null,null,null,null,null,null,null,null,null,null,null,null,null,null,null,null,null,null,null,null,null,null,null,null,null,null,null,null,null,null,null,null,null,null,null,null,null,null,null,null,""]
[null,null,null,null,null,null,null,null,null,null,null,null,null,null,null,null,null,null,null,null,null,null,null,null,null,null,null,null,null,null,null,null,null,null,null,null,null,null,null,null,null,null,null,null,null,null,null,null,null,null,null,null,null,null,null,null,null,null,null,null,null,null,null,null,null,null,null,""]
[null,null,null,null,null,null,null,null,null,null,null,null,null,null,null,null,null,null,null,null,null,null,null,null,null,null,null,null,null,null,null,null,null,null,null,null,null,null,null,null,null,null,null,null,null,null,null,null,null,null,null,null,null,null,null,null,null,null,null,null,null,null,null,null,null,null,null,""]
[null,null,null,null,null,null,null,null,null,null,null,null,null,null,null,null,null,null,null,null,null,null,null,null,null,null,null,null,null,null,null,null,null,null,null,null,null,null,null,null,null,null,null,null,null,null,null,null,null,null,null,null,null,null,null,null,null,null,null,null,null,null,null,null,null,null,null,""]
[null,null,null,null,null,null,null,null,null,null,null,null,null,null,null,null,null,null,null,null,null,null,null,null,null,null,null,null,null,null,null,null,null,null,null,null,null,null,null,null,null,null,null,null,null,null,null,null,null,null,null,null,null,null,null,null,null,null,null,null,null,null,null,null,null,null,null,""]
[null,null,null,null,null,null,null,null,null,null,null,null,null,null,null,null,null,null,null,null,null,null,null,null,null,null,null,null,null,null,null,null,null,null,null,null,null,null,null,null,null,null,null,null,null,null,null,null,null,null,null,null,null,null,null,null,null,null,null,null,null,null,null,null,null,null,null,""]
[null,null,null,null,null,null,null,null,null,null,null,null,null,null,null,null,null,null,null,null,null,null,null,null,null,null,null,null,null,null,null,null,null,null,null,null,null,null,null,null,null,null,null,null,null,null,null,null,null,null,null,null,null,null,null,null,null,null,null,null,null,null,null,null,null,null,null,""]
[null,null,null,null,null,null,null,null,null,null,null,null,null,null,null,null,null,null,null,null,null,null,null,null,null,null,null,null,null,null,null,null,null,null,null,null,null,null,null,null,null,null,null,null,null,null,null,null,null,null,null,null,null,null,null,null,null,null,null,null,null,null,null,null,null,null,null,""]
[null,null,null,null,null,null,null,null,null,null,null,null,null,null,null,null,null,null,null,null,null,null,null,null,null,null,null,null,null,null,null,null,null,null,null,null,null,null,null,null,null,null,null,null,null,null,null,null,null,null,null,null,null,null,null,null,null,null,null,null,null,null,null,null,null,null,null,""]
[null,null,null,null,null,null,null,null,null,null,null,null,null,null,null,null,null,null,null,null,null,null,null,null,null,null,null,null,null,null,null,null,null,null,null,null,null,null,null,null,null,null,null,null,null,null,null,null,null,null,null,null,null,null,null,null,null,null,null,null,null,null,null,null,null,null,null,""]
[null,null,null,null,null,null,null,null,null,null,null,null,null,null,null,null,null,null,null,null,null,null,null,null,null,null,null,null,null,null,null,null,null,null,null,null,null,null,null,null,null,null,null,null,null,null,null,null,null,null,null,null,null,null,null,null,null,null,null,null,null,null,null,null,null,null,null,""]
[null,null,null,null,null,null,null,null,null,null,null,null,null,null,null,null,null,null,null,null,null,null,null,null,null,null,null,null,null,null,null,null,null,null,null,null,null,null,null,null,null,null,null,null,null,null,null,null,null,null,null,null,null,null,null,null,null,null,null,null,null,null,null,null,null,null,null,""]
[null,null,null,null,null,null,null,null,null,null,null,null,null,null,null,null,null,null,null,null,null,null,null,null,null,null,null,null,null,null,null,null,null,null,null,null,null,null,null,null,null,null,null,null,null,null,null,null,null,null,null,null,null,null,null,null,null,null,null,null,null,null,null,null,null,null,null,""]
[null,null,null,null,null,null,null,null,null,null,null,null,null,null,null,null,null,null,null,null,null,null,null,null,null,null,null,null,null,null,null,null,null,null,null,null,null,null,null,null,null,null,null,null,null,null,null,null,null,null,null,null,null,null,null,null,null,null,null,null,null,null,null,null,null,null,null,""]
[null,null,null,null,null,null,null,null,null,null,null,null,null,null,null,null,null,null,null,null,null,null,null,null,null,null,null,null,null,null,null,null,null,null,null,null,null,null,null,null,null,null,null,null,null,null,null,null,null,null,null,null,null,null,null,null,null,null,null,null,null,null,null,null,null,null,null,""]
[null,null,null,null,null,null,null,null,null,null,null,null,null,null,null,null,null,null,null,null,null,null,null,null,null,null,null,null,null,null,null,null,null,null,null,null,null,null,null,null,null,null,null,null,null,null,null,null,null,null,null,null,null,null,null,null,null,null,null,null,null,null,null,null,null,null,null,""]
[null,null,null,null,null,null,null,null,null,null,null,null,null,null,null,null,null,null,null,null,null,null,null,null,null,null,null,null,null,null,null,null,null,null,null,null,null,null,null,null,null,null,null,null,null,null,null,null,null,null,null,null,null,null,null,null,null,null,null,null,null,null,null,null,null,null,null,""]
[null,null,null,null,null,null,null,null,null,null,null,null,null,null,null,null,null,null,null,null,null,null,null,null,null,null,null,null,null,null,null,null,null,null,null,null,null,null,null,null,null,null,null,null,null,null,null,null,null,null,null,null,null,null,null,null,null,null,null,null,null,null,null,null,null,null,null,""]
[null,null,null,null,null,null,null,null,null,null,null,null,null,null,null,null,null,null,null,null,null,null,null,null,null,null,null,null,null,null,null,null,null,null,null,null,null,null,null,null,null,null,null,null,null,null,null,null,null,null,null,null,null,null,null,null,null,null,null,null,null,null,null,null,null,null,null,""]
[null,null,null,null,null,null,null,null,null,null,null,null,null,null,null,null,null,null,null,null,null,null,null,null,null,null,null,null,null,null,null,null,null,null,null,null,null,null,null,null,null,null,null,null,null,null,null,null,null,null,null,null,null,null,null,null,null,null,null,null,null,null,null,null,null,null,null,""]
[null,null,null,null,null,null,null,null,null,null,null,null,null,null,null,null,null,null,null,null,null,null,null,null,null,null,null,null,null,null,null,null,null,null,null,null,null,null,null,null,null,null,null,null,null,null,null,null,null,null,null,null,null,null,null,null,null,null,null,null,null,null,null,null,null,null,null,""]
[null,null,null,null,null,null,null,null,null,null,null,null,null,null,null,null,null,null,null,null,null,null,null,null,null,null,null,null,null,null,null,null,null,null,null,null,null,null,null,null,null,null,null,null,null,null,null,null,null,null,null,null,null,null,null,null,null,null,null,null,null,null,null,null,null,null,null,""]
[null,null,null,null,null,null,null,null,null,null,null,null,null,null,null,null,null,null,null,null,null,null,null,null,null,null,null,null,null,null,null,null,null,null,null,null,null,null,null,null,null,null,null,null,null,null,null,null,null,null,null,null,null,null,null,null,null,null,null,null,null,null,null,null,null,null,null,""]
[null,null,null,null,null,null,null,null,null,null,null,null,null,null,null,null,null,null,null,null,null,null,null,null,null,null,null,null,null,null,null,null,null,null,null,null,null,null,null,null,null,null,null,null,null,null,null,null,null,null,null,null,null,null,null,null,null,null,null,null,null,null,null,null,null,null,null,""]
[null,null,null,null,null,null,null,null,null,null,null,null,null,null,null,null,null,null,null,null,null,null,null,null,null,null,null,null,null,null,null,null,null,null,null,null,null,null,null,null,null,null,null,null,null,null,null,null,null,null,null,null,null,null,null,null,null,null,null,null,null,null,null,null,null,null,null,""]
[null,null,null,null,null,null,null,null,null,null,null,null,null,null,null,null,null,null,null,null,null,null,null,null,null,null,null,null,null,null,null,null,null,null,null,null,null,null,null,null,null,null,null,null,null,null,null,null,null,null,null,null,null,null,null,null,null,null,null,null,null,null,null,null,null,null,null,""]
[null,null,null,null,null,null,null,null,null,null,null,null,null,null,null,null,null,null,null,null,null,null,null,null,null,null,null,null,null,null,null,null,null,null,null,null,null,null,null,null,null,null,null,null,null,null,null,null,null,null,null,null,null,null,null,null,null,null,null,null,null,null,null,null,null,null,null,""]
[null,null,null,null,null,null,null,null,null,null,null,null,null,null,null,null,null,null,null,null,null,null,null,null,null,null,null,null,null,null,null,null,null,null,null,null,null,null,null,null,null,null,null,null,null,null,null,null,null,null,null,null,null,null,null,null,null,null,null,null,null,null,null,null,null,null,null,""]
[null,null,null,null,null,null,null,null,null,null,null,null,null,null,null,null,null,null,null,null,null,null,null,null,null,null,null,null,null,null,null,null,null,null,null,null,null,null,null,null,null,null,null,null,null,null,null,null,null,null,null,null,null,null,null,null,null,null,null,null,null,null,null,null,null,null,null,""]
[null,null,null,null,null,null,null,null,null,null,null,null,null,null,null,null,null,null,null,null,null,null,null,null,null,null,null,null,null,null,null,null,null,null,null,null,null,null,null,null,null,null,null,null,null,null,null,null,null,null,null,null,null,null,null,null,null,null,null,null,null,null,null,null,null,null,null,""]
[null,null,null,null,null,null,null,null,null,null,null,null,null,null,null,null,null,null,null,null,null,null,null,null,null,null,null,null,null,null,null,null,null,null,null,null,null,null,null,null,null,null,null,null,null,null,null,null,null,null,null,null,null,null,null,null,null,null,null,null,null,null,null,null,null,null,null,""]
[null,null,null,null,null,null,null,null,null,null,null,null,null,null,null,null,null,null,null,null,null,null,null,null,null,null,null,null,null,null,null,null,null,null,null,null,null,null,null,null,null,null,null,null,null,null,null,null,null,null,null,null,null,null,null,null,null,null,null,null,null,null,null,null,null,null,null,""]
[null,null,null,null,null,null,null,null,null,null,null,null,null,null,null,null,null,null,null,null,null,null,null,null,null,null,null,null,null,null,null,null,null,null,null,null,null,null,null,null,null,null,null,null,null,null,null,null,null,null,null,null,null,null,null,null,null,null,null,null,null,null,null,null,null,null,null,""]
[null,null,null,null,null,null,null,null,null,null,null,null,null,null,null,null,null,null,null,null,null,null,null,null,null,null,null,null,null,null,null,null,null,null,null,null,null,null,null,null,null,null,null,null,null,null,null,null,null,null,null,null,null,null,null,null,null,null,null,null,null,null,null,null,null,null,null,""]
[null,null,null,null,null,null,null,null,null,null,null,null,null,null,null,null,null,null,null,null,null,null,null,null,null,null,null,null,null,null,null,null,null,null,null,null,null,null,null,null,null,null,null,null,null,null,null,null,null,null,null,null,null,null,null,null,null,null,null,null,null,null,null,null,null,null,null,""]
[null,null,null,null,null,null,null,null,null,null,null,null,null,null,null,null,null,null,null,null,null,null,null,null,null,null,null,null,null,null,null,null,null,null,null,null,null,null,null,null,null,null,null,null,null,null,null,null,null,null,null,null,null,null,null,null,null,null,null,null,null,null,null,null,null,null,null,""]
[null,null,null,null,null,null,null,null,null,null,null,null,null,null,null,null,null,null,null,null,null,null,null,null,null,null,null,null,null,null,null,null,null,null,null,null,null,null,null,null,null,null,null,null,null,null,null,null,null,null,null,null,null,null,null,null,null,null,null,null,null,null,null,null,null,null,null,""]
[null,null,null,null,null,null,null,null,null,null,null,null,null,null,null,null,null,null,null,null,null,null,null,null,null,null,null,null,null,null,null,null,null,null,null,null,null,null,null,null,null,null,null,null,null,null,null,null,null,null,null,null,null,null,null,null,null,null,null,null,null,null,null,null,null,null,null,""]
[null,null,null,null,null,null,null,null,null,null,null,null,null,null,null,null,null,null,null,null,null,null,null,null,null,null,null,null,null,null,null,null,null,null,null,null,null,null,null,null,null,null,null,null,null,null,null,null,null,null,null,null,null,null,null,null,null,null,null,null,null,null,null,null,null,null,null,""]
[null,null,null,null,null,null,null,null,null,null,null,null,null,null,null,null,null,null,null,null,null,null,null,null,null,null,null,null,null,null,null,null,null,null,null,null,null,null,null,null,null,null,null,null,null,null,null,null,null,null,null,null,null,null,null,null,null,null,null,null,null,null,null,null,null,null,null,""]
[null,null,null,null,null,null,null,null,null,null,null,null,null,null,null,null,null,null,null,null,null,null,null,null,null,null,null,null,null,null,null,null,null,null,null,null,null,null,null,null,null,null,null,null,null,null,null,null,null,null,null,null,null,null,null,null,null,null,null,null,null,null,null,null,null,null,null,""]
[null,null,null,null,null,null,null,null,null,null,null,null,null,null,null,null,null,null,null,null,null,null,null,null,null,null,null,null,null,null,null,null,null,null,null,null,null,null,null,null,null,null,null,null,null,null,null,null,null,null,null,null,null,null,null,null,null,null,null,null,null,null,null,null,null,null,null,""]
[null,null,null,null,null,null,null,null,null,null,null,null,null,null,null,null,null,null,null,null,null,null,null,null,null,null,null,null,null,null,null,null,null,null,null,null,null,null,null,null,null,null,null,null,null,null,null,null,null,null,null,null,null,null,null,null,null,null,null,null,null,null,null,null,null,null,null,""]
[null,null,null,null,null,null,null,null,null,null,null,null,null,null,null,null,null,null,null,null,null,null,null,null,null,null,null,null,null,null,null,null,null,null,null,null,null,null,null,null,null,null,null,null,null,null,null,null,null,null,null,null,null,null,null,null,null,null,null,null,null,null,null,null,null,null,null,""]
[null,null,null,null,null,null,null,null,null,null,null,null,null,null,null,null,null,null,null,null,null,null,null,null,null,null,null,null,null,null,null,null,null,null,null,null,null,null,null,null,null,null,null,null,null,null,null,null,null,null,null,null,null,null,null,null,null,null,null,null,null,null,null,null,null,null,null,""]
[null,null,null,null,null,null,null,null,null,null,null,null,null,null,null,null,null,null,null,null,null,null,null,null,null,null,null,null,null,null,null,null,null,null,null,null,null,null,null,null,null,null,null,null,null,null,null,null,null,null,null,null,null,null,null,null,null,null,null,null,null,null,null,null,null,null,null,""]
[null,null,null,null,null,null,null,null,null,null,null,null,null,null,null,null,null,null,null,null,null,null,null,null,null,null,null,null,null,null,null,null,null,null,null,null,null,null,null,null,null,null,null,null,null,null,null,null,null,null,null,null,null,null,null,null,null,null,null,null,null,null,null,null,null,null,null,""]
[null,null,null,null,null,null,null,null,null,null,null,null,null,null,null,null,null,null,null,null,null,null,null,null,null,null,null,null,null,null,null,null,null,null,null,null,null,null,null,null,null,null,null,null,null,null,null,null,null,null,null,null,null,null,null,null,null,null,null,null,null,null,null,null,null,null,null,""]
[null,null,null,null,null,null,null,null,null,null,null,null,null,null,null,null,null,null,null,null,null,null,null,null,null,null,null,null,null,null,null,null,null,null,null,null,null,null,null,null,null,null,null,null,null,null,null,null,null,null,null,null,null,null,null,null,null,null,null,null,null,null,null,null,null,null,null,""]
[null,null,null,null,null,null,null,null,null,null,null,null,null,null,null,null,null,null,null,null,null,null,null,null,null,null,null,null,null,null,null,null,null,null,null,null,null,null,null,null,null,null,null,null,null,null,null,null,null,null,null,null,null,null,null,null,null,null,null,null,null,null,null,null,null,null,null,""]
[null,null,null,null,null,null,null,null,null,null,null,null,null,null,null,null,null,null,null,null,null,null,null,null,null,null,null,null,null,null,null,null,null,null,null,null,null,null,null,null,null,null,null,null,null,null,null,null,null,null,null,null,null,null,null,null,null,null,null,null,null,null,null,null,null,null,null,""]
[null,null,null,null,null,null,null,null,null,null,null,null,null,null,null,null,null,null,null,null,null,null,null,null,null,null,null,null,null,null,null,null,null,null,null,null,null,null,null,null,null,null,null,null,null,null,null,null,null,null,null,null,null,null,null,null,null,null,null,null,null,null,null,null,null,null,null,""]
[null,null,null,null,null,null,null,null,null,null,null,null,null,null,null,null,null,null,null,null,null,null,null,null,null,null,null,null,null,null,null,null,null,null,null,null,null,null,null,null,null,null,null,null,null,null,null,null,null,null,null,null,null,null,null,null,null,null,null,null,null,null,null,null,null,null,null,""]
[null,null,null,null,null,null,null,null,null,null,null,null,null,null,null,null,null,null,null,null,null,null,null,null,null,null,null,null,null,null,null,null,null,null,null,null,null,null,null,null,null,null,null,null,null,null,null,null,null,null,null,null,null,null,null,null,null,null,null,null,null,null,null,null,null,null,null,""]
[null,null,null,null,null,null,null,null,null,null,null,null,null,null,null,null,null,null,null,null,null,null,null,null,null,null,null,null,null,null,null,null,null,null,null,null,null,null,null,null,null,null,null,null,null,null,null,null,null,null,null,null,null,null,null,null,null,null,null,null,null,null,null,null,null,null,null,""]
[null,null,null,null,null,null,null,null,null,null,null,null,null,null,null,null,null,null,null,null,null,null,null,null,null,null,null,null,null,null,null,null,null,null,null,null,null,null,null,null,null,null,null,null,null,null,null,null,null,null,null,null,null,null,null,null,null,null,null,null,null,null,null,null,null,null,null,""]
[null,null,null,null,null,null,null,null,null,null,null,null,null,null,null,null,null,null,null,null,null,null,null,null,null,null,null,null,null,null,null,null,null,null,null,null,null,null,null,null,null,null,null,null,null,null,null,null,null,null,null,null,null,null,null,null,null,null,null,null,null,null,null,null,null,null,null,""]
[null,null,null,null,null,null,null,null,null,null,null,null,null,null,null,null,null,null,null,null,null,null,null,null,null,null,null,null,null,null,null,null,null,null,null,null,null,null,null,null,null,null,null,null,null,null,null,null,null,null,null,null,null,null,null,null,null,null,null,null,null,null,null,null,null,null,null,""]
[null,null,null,null,null,null,null,null,null,null,null,null,null,null,null,null,null,null,null,null,null,null,null,null,null,null,null,null,null,null,null,null,null,null,null,null,null,null,null,null,null,null,null,null,null,null,null,null,null,null,null,null,null,null,null,null,null,null,null,null,null,null,null,null,null,null,null,""]
[null,null,null,null,null,null,null,null,null,null,null,null,null,null,null,null,null,null,null,null,null,null,null,null,null,null,null,null,null,null,null,null,null,null,null,null,null,null,null,null,null,null,null,null,null,null,null,null,null,null,null,null,null,null,null,null,null,null,null,null,null,null,null,null,null,null,null,""]
[null,null,null,null,null,null,null,null,null,null,null,null,null,null,null,null,null,null,null,null,null,null,null,null,null,null,null,null,null,null,null,null,null,null,null,null,null,null,null,null,null,null,null,null,null,null,null,null,null,null,null,null,null,null,null,null,null,null,null,null,null,null,null,null,null,null,null,5]
[null,null,null,null,null,null,null,null,null,null,null,null,null,null,null,null,null,null,null,null,null,null,null,null,null,null,null,null,null,null,null,null,null,null,null,null,null,null,null,null,null,null,null,null,null,null,null,null,null,null,null,null,null,null,null,null,null,null,null,null,null,null,null,null,null,null,null,4]
[null,null,null,null,null,null,null,null,null,null,null,null,null,null,null,null,null,null,null,null,null,null,null,null,null,null,null,null,null,null,null,null,null,null,null,null,null,null,null,null,null,null,null,null,null,null,null,null,null,null,null,null,null,null,null,null,null,null,null,null,null,null,null,null,null,null,null,3]
[null,null,null,null,null,null,null,null,null,null,null,null,null,null,null,null,null,null,null,null,null,null,null,null,null,null,null,null,null,null,null,null,null,null,null,null,null,null,null,null,null,null,null,null,null,null,null,null,null,null,null,null,null,null,null,null,null,null,null,null,null,null,null,null,null,null,null,2]

{"sheet":"Listas","index":9,"n_rows":31,"n_cols":19,"rows_kept":31,"cut":false,"hidden":true,"merged":[]}
["Dependencias","Siglas","Tipo de indicador","Lista de pactos","Pacto","Línea","Objetivo","Unidad de Medida","Dimensión MIPG","Proceso","Obts Estratégicos de la entidad","Tipología","Periodicidad","ODS","ODS principal","Dimensión Estratégica","Objetivo sector","Tendencia","PLANES"]
["DPR-Dirección de Política y Regulación","DPR","Gestión - PEI","I. Pacto por la legalidad: seguridad efectiva y justicia transparente para que todos vivamos con libertad y en democracia","I. Pacto por la legalidad: seguridad efectiva y justicia transparente para que todos vivamos con libertad y en democracia","B. Imperio de la ley: derechos humanos, justicia accesible, oportuna y en toda Colombia, para todos","Objetivo 5. Defensa jurídica del Estado ","Porcentaje","Dimensión 1. Talento Humano","Direccionamiento Estratégico","Fortalecer la capacidad institucional de las entidades nacionales del sector y las  territoriales en la estructuración de  proyectos y esquemas de prestación sostenibles","Calidad","Mensual","-","-","Agua Potable y Saneamiento Básico","Mejorar la cobertura, calidad y continuidad de los servicios de Agua Potable y Saneamiento Básico","Suma","Plan Anticorrupción y de Atención al Ciudadano"]
["DEUT-Dirección de Espacio Urbano y Territorial","DEUT","PND","III. Pacto por la Equidad: política social moderna centrada en la familia, eficiente, de calidad y conectada a mercados","I. Pacto por la legalidad: seguridad efectiva y justicia transparente para que todos vivamos con libertad y en democracia","C. Alianza contra la corrupción: tolerancia cero con los corruptos","Objetivo 1. Pacto de cero tolerancia a la corrupción y a la falta de transparencia","Número","Dimensión 2. Direccionamiento Estratégico y Planeación ","Gestión de Tecnologías de la Información y las Comunicaciones","Armonizar la planeación para el desarrollo y el ordenamiento territorial","Eficacia ","Bimensual","ODS 1. Fin de la pobreza","ODS 6. Agua limpia y saneamiento","Desarrollo Urbano y Territorial","Promover el desarrollo urbano y territorial","Creciente","Plan Anual de Adquisiciones"]
["DIVIS-Dirección de Inversiones en Vivienda de Interés Social","DIVIS",null,"V. Pacto por la ciencia, la tecnología y la innovación: un sistema para construir el conocimiento de la Colombia del futuro","I. Pacto por la legalidad: seguridad efectiva y justicia transparente para que todos vivamos con libertad y en democracia","D. Colombia en la escena global: política exterior responsable, innovadora y constructiva","Objetivo 1. Participación activa y liderazgo en la gobernanza de los grandes temas y desafíos de la agenda global que afectan a Colombia, y apuesta por el multilateralismo en defensa de la paz, la seguridad y la democracia",null,"Dimensión 3. Gestión con Valores para Resultados","Gestión Estratégica de Talento Humano","Aumentar coberturas de acueducto y alcantarillado en zonas rurales y zonas urbanas con grandes brechas","Eficiencia","Trimestral","ODS 11. Ciudades y comunidades sostenibles","ODS 11. Ciudades y comunidades sostenibles","Institucional","Robustecer la capacidad de gestión y desempeño de las entidades del sector","Decreciente","Plan Anual de Vacantes"]
["DM-Despacho de Ministro","DM",null,"VII. Pacto por la transformación digital de Colombia: gobierno, empresas y hogares conectados con la era del conocimiento","III. Pacto por la Equidad: política social moderna centrada en la familia, eficiente, de calidad y conectada a mercados","E. Vivienda y entornos dignos e incluyentes","Objetivo 1. Mejorar las condiciones físicas y sociales de viviendas, entornos y asentamientos precarios, a través de la implementación de políticas para el mejoramiento de vivienda y barrios para los hogares de menores ingresos. ",null,"Dimensión 4. Evaluación de Resultados","Gestión de Comunicaciones Internas y Externas","Consolidar el Sistema de Ciudades como dinamizador del desarrollo territorial y la productividad","Producto","Cuatrimestral","ODS 12. Producción y consumo responsables","ODS 5. Igualdad de género","Vivienda","Aumentar el acceso a vivienda digna","Constante","Plan de Incentivos Institucionales"]
["DIDE-Dirección de Infraestructura y Desarrollo Empresarial","DIDE",null,"VIII. Pacto por la calidad y eficiencia de los servicios públicos: agua y energía para promover la competitividad y el bienestar de todos","III. Pacto por la Equidad: política social moderna centrada en la familia, eficiente, de calidad y conectada a mercados","E. Vivienda y entornos dignos e incluyentes","Objetivo 2. Profundizar el acceso a soluciones de vivienda digna, a través de la complementariedad de esquemas de compra y arriendo subsidiado de vivienda y la facilitación del financiamiento formal a los hogares de menores ingresos.",null,"Dimensión 5.  Información y Comunicación ","Relaciones Estratégicas ","Fortalecer la eficiencia y sostenibilidad de los prestadores del sector","Resultado","Semestral","ODS 16. Paz, justicia e instituciones sólidas","ODS 16. Paz, justicia e instituciones sólidas",null,null,null,"Plan de Previsión de Recursos Humanos"]
["DSH-Dirección del Sistema Habitacional","DSH",null,"XI. Pacto por la Construcción de Paz: Cultura de la legalidad, convivencia, estabilización y víctimas","III. Pacto por la Equidad: política social moderna centrada en la familia, eficiente, de calidad y conectada a mercados","E. Vivienda y entornos dignos e incluyentes","Objetivo 3. Incrementar la productividad del sector de la construcción, a través del fortalecimiento y la formalización de la mano de obra, la mejora de procesos constructivos y la adopción de tecnologías y buenas prácticas gerenciales.",null,"Dimensión 6. Gestión del Conocimiento ","Gestión a la Política de Espacio Urbano y Territorial ","Fortalecer los estándares de transparencia y diálogo con la ciudadanía y los grupos de valor",null,"Anual","ODS 17. Alianza para lograr los objetivos","ODS 12. Producción y consumo responsables",null,null,null,"Plan de Seguridad y Privacidad de la Información"]
["DVR-Dirección de Vivienda Rural","DVR",null,"XII. Pacto por la equidad de oportunidades para grupos étnicos: Indígenas, Negros, Afrocolombianos, Raizales, Palenqueros y Rrom","III. Pacto por la Equidad: política social moderna centrada en la familia, eficiente, de calidad y conectada a mercados","E. Vivienda y entornos dignos e incluyentes",null,null,"Dimensión 7. Control Interno","Gestión a la Política de Agua Potable y Saneamiento Básico","Incrementar el tratamiento y aprovechamiento de residuos sólidos y aguas residuales domésticas urbanas",null,null,"ODS 5. Igualdad de género",null,null,null,null,"Plan de Trabajo Anual en Seguridad y Salud en el Trabajo"]
["GAUA-Grupo de Atención al Usuario y Archivo","GAUA",null,"XIV. Pacto de equidad para las mujeres","V. Pacto por la ciencia, la tecnología y la innovación: un sistema para construir el conocimiento de la Colombia del futuro","D. Innovación pública para un país moderno","Objetivo 5. Gestionar el conocimiento y los aprendizajes para crear valor público",null,null,"Gestión a la Política de Vivienda","Mejorar la provisión, calidad y/o continuidad de los servicios de acueducto y alcantarillado",null,null,"ODS 6. Agua limpia y saneamiento",null,null,null,null,"Plan de Tratamiento de Riesgos de Seguridad y Privacidad de la Información"]
["GC-Grupo de Contratos ","GC",null,"XV. Pacto por una gestión pública efectiva","V. Pacto por la ciencia, la tecnología y la innovación: un sistema para construir el conocimiento de la Colombia del futuro","D. Innovación pública para un país moderno","Objetivo 5. Gestionar el conocimiento y los aprendizajes para crear valor público.",null,null,"Gestión de Recursos Físicos","Mejorar las condiciones físicas y sociales de viviendas, entornos y aglomeraciones humanas de desarrollo incompleto",null,null,null,null,null,null,null,"Plan Estratégico de Talento Humano"]
["GCE-Grupo de Comunicaciones Estratégicas","GCE",null,"XVI. Pacto por la descentralización: conectar territorios, gobiernos y poblaciones","VII. Pacto por la transformación digital de Colombia: gobierno, empresas y hogares conectados con la era del conocimiento","B. Hacia una sociedad digital e industria 4.0: por una relación más eficiente, efectiva y transparente entre mercados, ciudadanos y Estado","Objetivo 1. Impulsar la transformación digital de la administración pública ",null,null,"Gestión de Contratación","Mejorar las políticas de gestión y desempeño",null,null,null,null,null,null,null,"Plan Estratégico de Tecnologías de la Información y las Comunicaciones ­ PETI"]
["GCID-Grupo de Control Interno Disciplinario ","GCID",null,"Pacto.","VIII. Pacto por la calidad y eficiencia de los servicios públicos: agua y energía para promover la competitividad y el bienestar de todos","\nB. Agua limpia y saneamiento básico adecuado: hacia una gestión responsable, sostenible y equitativa","Objetivo 1. Implementar estrategias para el logro de una prestación eficiente, sostenible e incluyente de los servicios de APSB con orientación regional, y una política nacional de gestión integral de residuos sólidos que articule el concepto de economía circular",null,null,"Procesos Judiciales y Acciones Constitucionales","Profundizar el acceso a soluciones de vivienda digna a los hogares de menores ingresos.",null,null,null,null,null,null,null,"Plan Institucional de Archivos de la Entidad ­PINAR"]
["GRF-Grupo de Recursos Físicos","GRF",null,null,"VIII. Pacto por la calidad y eficiencia de los servicios públicos: agua y energía para promover la competitividad y el bienestar de todos","\nB. Agua limpia y saneamiento básico adecuado: hacia una gestión responsable, sostenible y equitativa","Objetivo 4. Incorporar las modificaciones pertinentes al esquema y capacidad institucional del sector, para mejorar la ejecución de proyectos y fortalecer la vigilancia y regulación oportuna y diferenciada a las empresas.",null,null,"Conceptos Jurídicos","Promover el desarrollo urbano equilibrado y sostenible",null,null,null,null,null,null,null,"Plan Institucional de Capacitación"]
["GTH-Grupo de Talento Humano","GTH",null,null,"VIII. Pacto por la calidad y eficiencia de los servicios públicos: agua y energía para promover la competitividad y el bienestar de todos","\nB. Agua limpia y saneamiento básico adecuado: hacia una gestión responsable, sostenible y equitativa","Objetivo 5. Adoptar medidas para proteger las fuentes de agua y garantizar su sostenibilidad en el tiempo, con un enfoque de Economía Circular",null,null,"Procesos Disciplinarios","Promover la implementación de la gestión del conocimiento e innovación en el ministerio"]
["OAJ-Oficina Asesora Jurídica","OAJ",null,null,"XI. Pacto por la Construcción de Paz: Cultura de la legalidad, convivencia, estabilización y víctimas"," A. Acciones efectivas para la política de estabilización: intervención coordinada en zonas estratégicas con seguridad, justicia y equidad","Objetivo 1. Estabilizar los territorios rurales, principalmente en los 170 municipios PDET",null,null,"Servicio al Ciudadano","Promover la productividad del sector de la construcción"]
["OAP-Oficina Asesora de Planeación ","OAP",null,null,"XII. Pacto por la equidad de oportunidades para grupos étnicos: Indígenas, Negros, Afrocolombianos, Raizales, Palenqueros y Rrom","B. Capítulo de grupos indígenas","Objetivo 6. Mejorar condiciones físicas y sociales de viviendas y entornos, a través de la implementación de políticas diferenciales, para el mejoramiento de las condiciones de habitabilidad de los hogares con menores ingresos en entornos rurales y urbanas.",null,null,"Gestión Documental"]
["OCI-Oficina de Control Interno","OCI",null,null,"XII. Pacto por la equidad de oportunidades para grupos étnicos: Indígenas, Negros, Afrocolombianos, Raizales, Palenqueros y Rrom","C. Capítulo de Rrom","Objetivo 6. Mejorar condiciones físicas y sociales de viviendas y entornos, a través de la implementación de políticas diferenciales, para el mejoramiento de las condiciones de habitabilidad de los hogares con menores ingresos en entornos rurales y urbanas.",null,null,"Saneamiento de Activos de los Extintos ICT INURBE"]
["OTIC-Oficina de Tecnologías de Información y Comunicaciones ","OTIC",null,null,"XII. Pacto por la equidad de oportunidades para grupos étnicos: Indígenas, Negros, Afrocolombianos, Raizales, Palenqueros y Rrom","D. Capítulo de comunidades negras, afrocolombianas, raizales y palenqueras","Objetivo 6. Mejorar condiciones físicas y sociales de viviendas y entornos, a través de la implementación de políticas diferenciales, para el mejoramiento de las condiciones de habitabilidad de los hogares con menores ingresos en entornos rurales y urbanas.",null,null,"Gestión Financiera"]
["SFP-Subdirección de Finanzas y Presupuesto","SFP",null,null,"XIV. Pacto de equidad para las mujeres","C. El cuidado, una apuesta de articulación y corresponsabilidad","Objetivo 2. Generar lineamientos de articulación de la oferta de programas disponible a nivel territorial con enfoque de género para las mujeres para reducir las cargas de cuidado de las mujeres",null,null,"Seguimiento y Mejora Continua "]
["SG-Secretaría General","SG",null,null,"XV. Pacto por una gestión pública efectiva","A. Transformación de la administración pública","Objetivo 1. Evaluar la arquitectura institucional del Gobierno con el fin de redefinir misiones, roles y competencias que permitan el funcionamiento eficiente del Estado en los diferentes niveles de gobierno",null,"Gestión del conocimiento y la innovación\nEvaluación de resultados","Evaluación Independiente y Asesoría "]
["SSA-Subdirección de Servicios Administrativos","SSA",null,null,"XV. Pacto por una gestión pública efectiva","A. Transformación de la administración pública","Objetivo 2. Mejorar la eficiencia y productividad en la gestión y las capacidades de las entidades públicas de los sectores",null,"Gestión del Conocimiento y la Innovación "]
[null,null,null,null,"XV. Pacto por una gestión pública efectiva","A. Transformación de la administración pública","Objetivo 1. Evaluar la arquitectura institucional del Gobierno con el fin de redefinir misiones, roles y competencias que permitan el funcionamiento eficiente del Estado en los diferentes niveles de gobierno",null,"Direccionamiento estratégico y planeación\nEvaluación de resultados"]
[null,null,null,null,"XV. Pacto por una gestión pública efectiva","A. Transformación de la administración pública","Objetivo 2. Mejorar la eficiencia y productividad en la gestión y las capacidades de las entidades públicas de los sectores",null,"Direccionamiento estratégico y planeación\nGestión con valores para resultados\nGestión del conocimiento y la innovación"]
[null,null,null,null,"XV. Pacto por una gestión pública efectiva","B. Gasto público efectivo","Objetivo 1. Fortalecer los instrumentos para la asignación estratégica y responsabilidad del gasto público ",null,"Direccionamiento estratégico y planeación\nGestión con valores para resultados "]
[null,null,null,null,"XV. Pacto por una gestión pública efectiva","B. Gasto público efectivo","Objetivo 2. Simplificar y optimizar la contratación pública ",null,"Direccionamiento estratégico y planeación\nGestión con valores para resultados"]
[null,null,null,null,"XV. Pacto por una gestión pública efectiva","B. Gasto público efectivo","Objetivo 3. Optimizar la administración del patrimonio del Estado y la gestión de activos ",null,"Direccionamiento estratégico y planeación\nGestión con valores para resultados\nEvaluación de resultados"]
[null,null,null,null,"XV. Pacto por una gestión pública efectiva","B. Gasto público efectivo","Objetivo 3. Optimizar la administración del patrimonio del Estado y la gestión de activos \n",null,"Gestión con valores para el resultado "]
[null,null,null,null,"XVI. Pacto por la descentralización: conectar territorios, gobiernos y poblaciones","A. Políticas e inversiones para el desarrollo, el ordenamiento y el fortalecimiento de la asociatividad","Objetivo 2. Armonizar la planeación para el desarrollo y la planeación para el ordenamiento territorial"]
[null,null,null,null,"XVI. Pacto por la descentralización: conectar territorios, gobiernos y poblaciones","C. Desarrollo urbano y Sistema de Ciudades (SC) para la sostenibilidad, la productividad y la calidad de vida","Objetivo 1. Lograr el desarrollo urbano equilibrado mediante el aprovechamiento de la ciudad construida, la planificación de la expansión y la suburbanización con criterios de sostenibilidad y la optimización de los instrumentos de financiamiento"]
[null,null,null,null,"XVI. Pacto por la descentralización: conectar territorios, gobiernos y poblaciones","C. Desarrollo urbano y Sistema de Ciudades (SC) para la sostenibilidad, la productividad y la calidad de vida","Objetivo 2. Consolidar el SC como dinamizador del desarrollo territorial y la productividad"]
[null,null,null,null,"XVI. Pacto por la descentralización: conectar territorios, gobiernos y poblaciones","E. Instrumentos e información para la toma de decisiones que promuevan el desarrollo regional","Objetivo 2. Promover la implementación de la infraestructura de Datos Espaciales"]

{"sheet":"PEI2021","index":10,"n_rows":127,"n_cols":53,"rows_kept":127,"cut":false,"hidden":true,"merged":[[3,17,4,17],[3,18,4,18],[3,19,4,19],[3,0,4,0],[3,1,4,1],[3,2,4,2],[3,3,4,3],[3,4,3,6],[0,0,2,1],[0,2,2,27],[0,28,0,29],[1,28,1,29],[2,28,2,29],[3,29,4,29],[3,7,3,8],[3,9,4,9],[3,10,4,10],[3,11,4,11],[3,12,4,12],[3,20,4,20],[3,21,4,21],[3,22,4,22],[3,23,4,23],[3,24,3,27],[3,28,4,28],[3,13,4,13],[3,14,4,14],[3,15,4,15],[3,16,4,16]]}
[null,null,"FORMATO: PLAN ESTRATÉGICO SECTORIAL E INSTITUCIONAL\n\nPROCESO: PLANEACIÓN ESTRATÉGICA Y GESTIÓN DE RECURSOS FINANCIEROS ",null,null,null,null,null,null,null,null,null,null,null,null,null,null,null,null,null,null,null,null,null,null,null,null,null,"Versión: 6.0"]
[null,null,null,null,null,null,null,null,null,null,null,null,null,null,null,null,null,null,null,null,null,null,null,null,null,null,null,null,"Fecha: 27/11/2019"]
[null,null,null,null,null,null,null,null,null,null,null,null,null,null,null,null,null,null,null,null,null,null,null,null,null,null,null,null,"Código: PEF-F-09"]
["Indicador","Dimensión Estratégica","Objetivo Estratégico Sector","Objetivo Estratégico Entidad","PND",null,null,"ODS",null,"Dimensión MIPG","Proceso SIG Entidad","Indicador","Fórmula del Indicador","Objetivo del indicador","Definición Variable 1","Definición Variable 2","Tendencia","Fecha de Línea Base","Fuente de información","Días de rezago","Periodicidad","Tipología","Unidad de Medida","Línea Base","Metas",null,null,null,"Meta del Cuatrienio","Dependencia \nResponsable",null,null,null,"Indicador","Días ","Indicador ","Tipo ","Pacto","Línea","Objetivo","ODS","Transformacional "]
[null,null,null,null,"Pacto","Línea","Objetivo ","Principal ","Secundario",null,null,null,null,null,null,null,null,null,null,null,null,null,null,null,2019,2020,2021,2022,null,null,null,null,null,"PND o Gestión","Rezago","PES","Pacto","Pacto","Línea","Objetivo","Principal ","Si o No ",null,null,null,null,null,null,null,"Dependencia","Número de indicadores","PND","Gestión"]
["Área de suelo habilitado","Desarrollo Urbano y Territorial","Promover el desarrollo urbano y territorial","Promover el desarrollo urbano equilibrado y sostenible","XVI. Pacto por la descentralización: conectar territorios, gobiernos y poblaciones","C. Desarrollo urbano y Sistema de Ciudades (SC) para la sostenibilidad, la productividad y la calidad de vida","Objetivo 1. Lograr el desarrollo urbano equilibrado mediante el aprovechamiento de la ciudad construida, la planificación de la expansión y la suburbanización con criterios de sostenibilidad y la optimización de los instrumentos de financiamiento","ODS 11. Ciudades y comunidades sostenibles","ODS 7. Energía asequible y no contaminante","Dimensión 2. Direccionamiento Estratégico y Planeación ","Gestión a la Política de Espacio Urbano y Territorial ","Área de suelo habilitado","Sumatoria de hectáreas de suelo habilitado","Medir el número de hectáreas habilitadas para el desarrollo urbano a través de la adopción o modificación de diferentes instrumentos de planeación (identificados en el CONPES 3583 de 2009), como la incorporación al suelo urbano por Ley 1753 de 2015, la adopción ó modificación de operaciones urbanas integrales (MISN+MU+PIDU), la adopción ó modificación de planes parciales y las licencias de urbanismo adoptadas. Para este caso, el suelo habilitado hace referencia al suelo que se dispone para el desarrollo urbano a partir de la adopción o modificación de un instrumento de planeación.","Variable 1 Hectáreas de suelo habilitado: corresponde a las áreas de suelo habilitadas a través de la adopción o modificación de: i) Ampliación del perímetro urbano en la revisión de un POT, ii) Incorporación de suelo urbano por Ley 1753, iii)Operaciones urbanas integrales (MISN, MU, PIDU), iv) Planes parciales de desarrollo o renovación urbana, v) áreas reportadas por licenciamiento urbano. ",null,"Suma","2018-12-31","Dirección de Espacio Urbano y Territorial (DEUT)",60,"Trimestral","Resultado","Número",0,4000,5000,5000,2000,16000,"DEUT-Dirección de Espacio Urbano y Territorial",{"$f":"H6=I6","v":false},null,null,"PND",null,"PES","Transversal","XVI. Pacto por la descentralización: conectar territorios, gobiernos y poblaciones","C. Desarrollo urbano y Sistema de Ciudades (SC) para la sostenibilidad, la productividad y la calidad de vida","Objetivo 1. Lograr el desarrollo urbano equilibrado mediante el aprovechamiento de la ciudad construida, la planificación de la expansión y la suburbanización con criterios de sostenibilidad y la optimización de los instrumentos de financiamiento",null,null,null,null,null,null,null,null,null,"DEUT-Dirección de Espacio Urbano y Territorial",{"$f":"COUNTIFS($AD$6:$AD$127,AX6)","v":4},{"$f":"COUNTIFS($AD$6:$AD$127,AX6,$AH$6:$AH$127,$AZ$5)","v":3},{"$f":"COUNTIFS($AD$6:$AD$127,AX6,$AH$6:$AH$127,$BA$5)","v":1}]
["Hogares beneficiados con mejoramiento integral de barrios ","Vivienda","Aumentar el acceso a vivienda digna","Mejorar las condiciones físicas y sociales de viviendas, entornos y aglomeraciones humanas de desarrollo incompleto","III. Pacto por la Equidad: política social moderna centrada en la familia, eficiente, de calidad y conectada a mercados","E. Vivienda y entornos dignos e incluyentes","Objetivo 1. Mejorar las condiciones físicas y sociales de viviendas, entornos y asentamientos precarios, a través de la implementación de políticas para el mejoramiento de vivienda y barrios para los hogares de menores ingresos","ODS 11. Ciudades y comunidades sostenibles","ODS 7. Energía asequible y no contaminante","Dimensión 2. Direccionamiento Estratégico y Planeación ","Gestión a la Política de Vivienda","Hogares beneficiados con mejoramiento integral de barrios ","Sumatoria de hogares beneficiados con mejoramiento integral de barrios ","Medir el número de hogares beneficiados con la transformación del barrio a través de su legalización urbanística, realización de estudios y diseños definitivos y construcción de obras de infraestructura (redes de sevicios básicos domiciliarios, vías y andenes) y equipamiento público","Variable 1 Hogares beneficiados: corresponde al número de hogares beneficiados con la intervención del barrio (redes de servicios básicos domiciliarios, vías y andenes) según los polígonos definidos en cada proyecto y los hogares de los Programas de Vivienda Gratuita y VIPA beneficiados con equipamientos públicos (colegios y CDIs a máximo 500 m de distancia y parques a máximo 1.000 m). Un hogar se considera beneficiado a partir del momento en el que se firma el acta de inicio de obra",null,"Suma","2018-12-31","Dirección de Espacio Urbano y Territorial (DEUT)",null,"Trimestral","Resultado","Número",0,22000,11216,11297,11297,55810,"DEUT-Dirección de Espacio Urbano y Territorial",{"$f":"H7=I7","v":false},null,null,"PND",null,null,"Transversal","III. Pacto por la Equidad: política social moderna centrada en la familia, eficiente, de calidad y conectada a mercados","E. Vivienda y entornos dignos e incluyentes","Objetivo 1. Mejorar las condiciones físicas y sociales de viviendas, entornos y asentamientos precarios, a través de la implementación de políticas para el mejoramiento de vivienda y barrios para los hogares de menores ingresos",null,null,null,null,null,null,null,null,null,"DIDE-Dirección de Infraestructura y Desarrollo Empresarial",{"$f":"COUNTIFS($AD$6:$AD$127,AX7)","v":7},{"$f":"COUNTIFS($AD$6:$AD$127,AX7,$AH$6:$AH$127,$AZ$5)","v":2},{"$f":"COUNTIFS($AD$6:$AD$127,AX7,$AH$6:$AH$127,$BA$5)","v":5}]
["Instrumentos normativos actualizados y/o elaborados y publicados","Desarrollo Urbano y Territorial","Promover el desarrollo urbano y territorial","Promover el desarrollo urbano equilibrado y sostenible","XVI. Pacto por la descentralización: conectar territorios, gobiernos y poblaciones","C. Desarrollo urbano y Sistema de Ciudades (SC) para la sostenibilidad, la productividad y la calidad de vida","Objetivo 1. Lograr el desarrollo urbano equilibrado mediante el aprovechamiento de la ciudad construida, la planificación de la expansión y la suburbanización con criterios de sostenibilidad y la optimización de los instrumentos de financiamiento","ODS 11. Ciudades y comunidades sostenibles","ODS 7. Energía asequible y no contaminante","Dimensión 3. Gestión con Valores para Resultados","Gestión a la Política de Espacio Urbano y Territorial ","Instrumentos normativos actualizados y/o elaborados y publicados","Sumatoria de instrumentos normativos actualizados y/o elaborados y publicados","Medir el avance en el desarrollo de instrumentos normativos actualizados y/o elaborados y publicados","Variable 1: Instrumentos normativos: corresponde a los instrumentos normativos actualizados y/o elaborados para posteriormente ser publicados y remitidos a Secretaría General para trámite de firma",null,"Suma","2018-12-31","Dirección de Espacio Urbano y Territorial (DEUT)",null,"Trimestral","Resultado","Número",3,3,2,2,2,9,"DEUT-Dirección de Espacio Urbano y Territorial",false,null,null,"Gestión",null,null,"Transversal","XVI. Pacto por la descentralización: conectar territorios, gobiernos y poblaciones","C. Desarrollo urbano y Sistema de Ciudades (SC) para la sostenibilidad, la productividad y la calidad de vida","Objetivo 1. Lograr el desarrollo urbano equilibrado mediante el aprovechamiento de la ciudad construida, la planificación de la expansión y la suburbanización con criterios de sostenibilidad y la optimización de los instrumentos de financiamiento",null,null,null,null,null,null,null,null,null,"DIVIS-Dirección de Inversiones en Vivienda de Interés Social",14,9,5]
["Municipios acompañados en la revisión e implementación de los planes de ordenamiento territorial (POT)","Desarrollo Urbano y Territorial","Promover el desarrollo urbano y territorial","Armonizar la planeación para el desarrollo y el ordenamiento territorial","XVI. Pacto por la descentralización: conectar territorios, gobiernos y poblaciones","A. Políticas e inversiones para el desarrollo, el ordenamiento y el fortalecimiento de la asociatividad","Objetivo 2. Armonizar la planeación para el desarrollo y la planeación para el ordenamiento territorial","ODS 11. Ciudades y comunidades sostenibles","ODS 7. Energía asequible y no contaminante","Dimensión 2. Direccionamiento Estratégico y Planeación ","Gestión a la Política de Espacio Urbano y Territorial ","Municipios acompañados en la revisión e implementación de los planes de ordenamiento territorial (POT)","Sumatoria de municipios acompañados en la revisión e implementación de los planes de ordenamiento territorial (POT)","Medir el número de entidades territoriales (municipios) apoyadas en la formulación e implementación de los POT","Variable 1 Municipios acompañados: corresponde al número de municipios que reciben asistencia técnica desde el gobierno nacional para la revisión y/o implementación de sus planes de ordenamiento territorial (POT), en por lo menos una actividad o producto en alguna de las siguiente etapas: preliminar (incluye insumos de cartografia), diagnóstico (incluye insumos de gestión de riesgos), formulación, concertación/consulta o adopción, contribuyendo a la armonización de la planeación para el desarrollo y el ordenamiento territorial",null,"Suma","2017-12-31","Dirección de Espacio Urbano y Territorial (DEUT)",30,"Trimestral","Resultado","Número",52,32,45,45,28,150,"DEUT-Dirección de Espacio Urbano y Territorial",false,null,null,"PND",180,null,"Transversal","XVI. Pacto por la descentralización: conectar territorios, gobiernos y poblaciones","A. Políticas e inversiones para el desarrollo, el ordenamiento y el fortalecimiento de la asociatividad","Objetivo 2. Armonizar la planeación para el desarrollo y la planeación para el ordenamiento territorial","ODS 6. Agua limpia y saneamiento","NO",null,null,null,null,null,null,null,"DM-Despacho de Ministro",5,0,5]
["Acciones institucionales que aseguran una gestión pública más efectiva ","Institucional","Robustecer la capacidad de gestión y desempeño de las entidades del sector","Mejorar las políticas de gestión y desempeño","XV. Pacto por una gestión pública efectiva","A. Transformación de la administración\npública","Objetivo 2. Mejorar la eficiencia y productividad en la gestión y las capacidades de las entidades públicas de los sectores","ODS 16. Paz, justicia e instituciones sólidas","ODS 11. Ciudades y comunidades sostenibles","Dimensión 3. Gestión con Valores para Resultados","Gestión a la Política de Agua Potable y Saneamiento Básico","Acciones institucionales que aseguran una gestión pública más efectiva ","Sumatoria de acciones de gestión publica realizadas","Medir el desarrollo de acciones para el fortalecimiento de la gestión institucional ","Variable 1 Acciones de gestión publica: corresponde a la cantidad de acciones institucionales formuladas para una gestión pública mas efectiva. ",null,"Suma ","2019-12-31","DIDE-Dirección de Infraestructura y Desarrollo Empresarial (DIDE)","NA","Trimestral","Producto","Número",0,0,6,6,6,18,"DIDE-Dirección de Infraestructura y Desarrollo Empresarial",false,{"$f":"AE10/Y10","v":{"$error":"#DIV/0!"}},null,"Gestión",180,null,"Transversal","XV. Pacto por una gestión pública efectiva","A. Transformación de la administración\npública","Objetivo 2. Mejorar la eficiencia y productividad en la gestión y las capacidades de las entidades públicas de los sectores","ODS 6. Agua limpia y saneamiento","NO",null,null,null,null,null,null,null,"DPR-Dirección de Política y Regulación",34,30,4]
["Asistencias técnicas realizadas","Agua Potable y Saneamiento Básico","Mejorar la cobertura, calidad y continuidad de los servicios de Agua Potable y Saneamiento Básico"," Fortalecer la capacidad institucional de las entidades nacionales del sector y las  territoriales en la estructuración de  proyectos y esquemas de prestación sostenibles","VIII. Pacto por la calidad y eficiencia de los servicios públicos: agua y energía para promover la competitividad y el bienestar de todos","B. Agua limpia y saneamiento básico adecuado: hacia una gestión responsable, sostenible y equitativa","Objetivo 1. Implementar estrategias para el logro de una prestación eficiente, sostenible e incluyente de los servicios de APSB con orientación regional, y una política nacional de gestión integral de residuos sólidos que articule el concepto de economía circular","ODS 6. Agua limpia y saneamiento","ODS 11. Ciudades y comunidades sostenibles","Dimensión 3. Gestión con Valores para Resultados","Gestión a la Política de Agua Potable y Saneamiento Básico","Asistencias técnicas realizadas","Sumatoria de asistencias técnicas realizadas en el periodo ","Identificar el grado de cumplimiento de los requisitos para la presentación de proyectos ante comité técnico","Variable 1 Asistencias técnicas: corresponde a la cantidad de asistencias realizadas en el marco de planes, programas y proyectos del sector de agua potable",null,"Suma","2018-12-31","DIDE-Dirección de Infraestructura y Desarrollo Empresarial (DIDE)","NA","Trimestral","Eficacia","Número",320,450,450,450,450,1800,"DIDE-Dirección de Infraestructura y Desarrollo Empresarial",false,0,null,"Gestión",60,null,"Transversal","VIII. Pacto por la calidad y eficiencia de los servicios públicos: agua y energía para promover la competitividad y el bienestar de todos","B. Agua limpia y saneamiento básico adecuado: hacia una gestión responsable, sostenible y equitativa","Objetivo 1. Implementar estrategias para el logro de una prestación eficiente, sostenible e incluyente de los servicios de APSB con orientación regional, y una política nacional de gestión integral de residuos sólidos que articule el concepto de economía circular","ODS 6. Agua limpia y saneamiento","NO",null,null,null,null,null,null,null,"DSH-Dirección del Sistema Habitacional",10,{"$f":"COUNTIFS($AD$6:$AD$127,AX11,$AH$6:$AH$127,$AZ$5)","v":7},{"$f":"COUNTIFS($AD$6:$AD$127,AX11,$AH$6:$AH$127,$BA$5)","v":3}]
["Lineamientos de política pública para el fortalecimiento de capacidades en el sector de APSB","Agua Potable y Saneamiento Básico","Mejorar la cobertura, calidad y continuidad de los servicios de Agua Potable y Saneamiento Básico","Aumentar coberturas de acueducto y alcantarillado en zonas rurales y zonas urbanas con grandes brechas","VIII. Pacto por la calidad y eficiencia de los servicios públicos: agua y energía para promover la competitividad y el bienestar de todos","B. Agua limpia y saneamiento básico adecuado: hacia una gestión responsable, sostenible y equitativa","Objetivo 4. Incorporar las modificaciones pertinentes al esquema y capacidad institucional del sector, para mejorar la ejecución de proyectos y fortalecer la vigilancia y regulación oportuna y diferenciada a las empresas","ODS 6. Agua limpia y saneamiento","ODS 11. Ciudades y comunidades sostenibles","Dimensión 3. Gestión con Valores para Resultados","Gestión a la Política de Agua Potable y Saneamiento Básico","Lineamientos de política pública para el fortalecimiento de capacidades en el sector de APSB","Sumatoria de instrumentos de política publica que fortalecen las capacidades en el sector de APSB","Medir el desarrollo de instrumentos normativos para fortalecimiento de la gestión institucional","Variable 1  Instrumentos de política pública: corresponde a la cantidad de lineamientos de política pública formulados ",null,"Suma","2019-12-31","DIDE-Dirección de Infraestructura y Desarrollo Empresarial (DIDE)","NA","Trimestral","Producto","Número",0,0,3,2,2,7,"DIDE-Dirección de Infraestructura y Desarrollo Empresarial",false,{"$error":"#DIV/0!"},null,"Gestión",180,null,"Transversal","VIII. Pacto por la calidad y eficiencia de los servicios públicos: agua y energía para promover la competitividad y el bienestar de todos","B. Agua limpia y saneamiento básico adecuado: hacia una gestión responsable, sostenible y equitativa","Objetivo 4. Incorporar las modificaciones pertinentes al esquema y capacidad institucional del sector, para mejorar la ejecución de proyectos y fortalecer la vigilancia y regulación oportuna y diferenciada a las empresas","ODS 6. Agua limpia y saneamiento","NO",null,null,null,null,null,null,null,"DVR-Dirección de Vivienda Rural",7,5,2]
["Nuevas conexiones Intradomiciliarias","Vivienda","Aumentar el acceso a vivienda digna","Mejorar las condiciones físicas y sociales de viviendas, entornos y aglomeraciones humanas de desarrollo incompleto","VIII. Pacto por la calidad y eficiencia de los servicios públicos: agua y energía para promover la competitividad y el bienestar de todos","B. Agua limpia y saneamiento básico adecuado: hacia una gestión responsable, sostenible y equitativa","Objetivo 1. Implementar estrategias para el logro de una prestación eficiente, sostenible e incluyente de los servicios de APSB con orientación regional, y una política nacional de gestión integral de residuos sólidos que articule el concepto de economía circular","ODS 6. Agua limpia y saneamiento","ODS 1. Fin de la pobreza","Dimensión 3. Gestión con Valores para Resultados","Gestión a la Política de Vivienda","Nuevas conexiones Intradomiciliarias","Cuenta de proyectos iniciados en inmuebles apoyados financieramente con el subsidio de conexiones Intradomiciliarias","Realizar el seguimiento a la meta del programa de mejoramiento de viviendas y barrios \"Casa Digna, Vida Digna\", en los componentes de conexiones intradomiciliarias","Variable 1 Nuevas conexiones intradomiciliarias: corresponde a la cantidad de inmuebles que son apoyados financieramente con recursos asignados al Programa de Conexiones Intradomiciliarias (PCI) del Viceministerio de Agua y Saneamiento Básico",null,"Suma ","2018-12-31","DIDE-Dirección de Infraestructura y Desarrollo Empresarial (DIDE)",30,"Semestral","Producto","Número",0,916,3416,6708,10000,10000,"DIDE-Dirección de Infraestructura y Desarrollo Empresarial",false,0,null,"PND",180,null,"Transversal","VIII. Pacto por la calidad y eficiencia de los servicios públicos: agua y energía para promover la competitividad y el bienestar de todos","B. Agua limpia y saneamiento básico adecuado: hacia una gestión responsable, sostenible y equitativa","Objetivo 1. Implementar estrategias para el logro de una prestación eficiente, sostenible e incluyente de los servicios de APSB con orientación regional, y una política nacional de gestión integral de residuos sólidos que articule el concepto de economía circular","ODS 6. Agua limpia y saneamiento","NO",null,null,null,null,null,null,null,"GAUA-Grupo de Atención al Usuario y Archivo",4,0,4]
["Nuevos esquemas regionales de prestación del servicio estructurados","Agua Potable y Saneamiento Básico","Mejorar la cobertura, calidad y continuidad de los servicios de Agua Potable y Saneamiento Básico","Fortalecer la eficiencia y sostenibilidad de los prestadores del sector","VIII. Pacto por la calidad y eficiencia de los servicios públicos: agua y energía para promover la competitividad y el bienestar de todos","B. Agua limpia y saneamiento básico adecuado: hacia una gestión responsable, sostenible y equitativa","Objetivo 1. Implementar estrategias para el logro de una prestación eficiente, sostenible e incluyente de los servicios de APSB con orientación regional, y una política nacional de gestión integral de residuos sólidos que articule el concepto de economía circular","ODS 6. Agua limpia y saneamiento","ODS 11. Ciudades y comunidades sostenibles","Dimensión 3. Gestión con Valores para Resultados","Gestión a la Política de Agua Potable y Saneamiento Básico","Nuevos esquemas regionales de prestación del servicio estructurados","Sumatoria de nuevos esquemas regionales de prestación del servicio estructurados","Conocer la cantidad de esquemas regionales del sector que logren economías de escala, mayor productividad y eficiencia en la gestión de los prestadores de servicios públicos","Variable 1 Esquemas regionales: corresponde a los nuevos esquemas regionales estructurados para mejorar la calidad en la prestación del servicio de agua potable y saneamiento y fortalecer a las empresas prestadoras",null,"Suma ","2018-12-31","DIDE-Dirección de Infraestructura y Desarrollo Empresarial (DIDE)","NA","Semestral","Producto","Número",0,1,1,1,1,4,"DIDE-Dirección de Infraestructura y Desarrollo Empresarial",false,0,null,"Gestión",180,null,"Transversal","VIII. Pacto por la calidad y eficiencia de los servicios públicos: agua y energía para promover la competitividad y el bienestar de todos","B. Agua limpia y saneamiento básico adecuado: hacia una gestión responsable, sostenible y equitativa","Objetivo 1. Implementar estrategias para el logro de una prestación eficiente, sostenible e incluyente de los servicios de APSB con orientación regional, y una política nacional de gestión integral de residuos sólidos que articule el concepto de economía circular","ODS 6. Agua limpia y saneamiento","NO",null,null,null,null,null,null,null,"GCE-Grupo de Comunicaciones Estratégicas",2,0,2]
["Personas beneficiadas con proyectos que mejoran provisión, calidad y/o continuidad de los servicios de acueducto y alcantarillado","Agua Potable y Saneamiento Básico","Mejorar la cobertura, calidad y continuidad de los servicios de Agua Potable y Saneamiento Básico","Mejorar la provisión, calidad y/o continuidad de los servicios de acueducto y alcantarillado","VIII. Pacto por la calidad y eficiencia de los servicios públicos: agua y energía para promover la competitividad y el bienestar de todos","B. Agua limpia y saneamiento básico adecuado: hacia una gestión responsable, sostenible y equitativa","Objetivo 1. Implementar estrategias para el logro de una prestación eficiente, sostenible e incluyente de los servicios de APSB con orientación regional, y una política nacional de gestión integral de residuos sólidos que articule el concepto de economía circular","ODS 6. Agua limpia y saneamiento","ODS 11. Ciudades y comunidades sostenibles","Dimensión 3. Gestión con Valores para Resultados","Gestión a la Política de Agua Potable y Saneamiento Básico","Personas beneficiadas con proyectos que mejoran provisión, calidad y/o continuidad de los servicios de acueducto y alcantarillado","Sumatoria de Personas beneficiadas con proyectos que mejoran provisión, calidad y/o continuidad de los servicios de acueducto y alcantarillado, terminados en el periodo","Medir el número de personas beneficiadas con proyectos del sector de agua potable y saneamiento básico (calidad y continuidad), financiados con recursos del Presupuesto General de la Nación","Variable 1 Personas beneficiadas: mide el número de personas beneficiadas con proyectos cofinanciados por el MVCT que mejoran provisión, calidad y/o continuidad de acueducto y alcantarillado",null,"Suma ","2018-12-31","DIDE-Dirección de Infraestructura y Desarrollo Empresarial (DIDE)",90,"Mensual","Producto","Número",0,2700000,2700000,2700000,2700000,10800000,"DIDE-Dirección de Infraestructura y Desarrollo Empresarial",false,0,null,"PND",180,null,"Transversal","VIII. Pacto por la calidad y eficiencia de los servicios públicos: agua y energía para promover la competitividad y el bienestar de todos","B. Agua limpia y saneamiento básico adecuado: hacia una gestión responsable, sostenible y equitativa","Objetivo 1. Implementar estrategias para el logro de una prestación eficiente, sostenible e incluyente de los servicios de APSB con orientación regional, y una política nacional de gestión integral de residuos sólidos que articule el concepto de economía circular","ODS 6. Agua limpia y saneamiento","SI",null,null,null,null,null,null,null,"GC-Grupo de Contratos ",1,0,1]
["Proyectos de inversión evaluados por el mecanismo de viabilización","Agua Potable y Saneamiento Básico","Mejorar la cobertura, calidad y continuidad de los servicios de Agua Potable y Saneamiento Básico","Aumentar coberturas de acueducto y alcantarillado en zonas rurales y zonas urbanas con grandes brechas","VIII. Pacto por la calidad y eficiencia de los servicios públicos: agua y energía para promover la competitividad y el bienestar de todos","B. Agua limpia y saneamiento básico adecuado: hacia una gestión responsable, sostenible y equitativa","Objetivo 1. Implementar estrategias para el logro de una prestación eficiente, sostenible e incluyente de los servicios de APSB con orientación regional, y una política nacional de gestión integral de residuos sólidos que articule el concepto de economía circular","ODS 6. Agua limpia y saneamiento","ODS 11. Ciudades y comunidades sostenibles","Dimensión 3. Gestión con Valores para Resultados","Gestión a la Política de Agua Potable y Saneamiento Básico","Proyectos de inversión evaluados por el mecanismo de viabilización","Sumatoria de proyectos evaluados","Medir el número de proyectos del sector de agua potable y saneamiento básico que se presentan por el mecanismo de viabilización ","Variable 1 proyectos evaluados: corresponde a la cantidad de proyectos evaluados por el mecanismo de viabilización.\nEl Mecanismo de Viabilización de Proyectos es el proceso mediante el cual el Ministerio de Vivienda, Ciudad y Territorio a través del Viceministerio de Agua y Saneamiento Básico, evalúa y aprueba los proyectos del sector de agua potable y saneamiento básico que soliciten apoyo financiero de la Nación, así como de aquellos que han sido priorizados en el marco de los Planes Departamentales de Agua y de los Programas que implemente el Ministerio de Vivienda, Ciudad y Territorio a través del Viceministerio de Agua y Saneamiento Básico. La evaluación de dichos proyectos contemplan los requerimientos legales, técnico, financiero, ambiental, entre otros, que son indispensables para la correcta ejecución de las obras del sector.\nProyecto viable se otorgará este concepto a los proyectos que cumplan con el lleno de los requisitos legales, institucionales, técnicos, financieros, ambientales y prediales evaluados, de acuerdo a la normativa vigente aplicable.",null,"Suma","2019-12-31","DIDE-Dirección de Infraestructura y Desarrollo Empresarial (DIDE)","NA","Trimestral","Producto","Número",0,0,25,25,25,75,"DIDE-Dirección de Infraestructura y Desarrollo Empresarial",false,null,{"$f":"AE16/Y16","v":{"$error":"#DIV/0!"}},"Gestión",180,"PES","Transversal","VIII. Pacto por la calidad y eficiencia de los servicios públicos: agua y energía para promover la competitividad y el bienestar de todos","B. Agua limpia y saneamiento básico adecuado: hacia una gestión responsable, sostenible y equitativa","Objetivo 1. Implementar estrategias para el logro de una prestación eficiente, sostenible e incluyente de los servicios de APSB con orientación regional, y una política nacional de gestión integral de residuos sólidos que articule el concepto de economía circular","ODS 6. Agua limpia y saneamiento","NO",null,null,null,null,null,null,null,"GCID-Grupo de Control Interno Disciplinario ",2,0,2]
["Hogares beneficiados con cobertura para adquisición de vivienda","Vivienda","Aumentar el acceso a vivienda digna","Profundizar el acceso a soluciones de vivienda digna a los hogares de menores ingresos.","III. Pacto por la Equidad: política social moderna centrada en la familia, eficiente, de calidad y conectada a mercados","E. Vivienda y entornos dignos e incluyentes","Objetivo 2. Profundizar el acceso a soluciones de vivienda digna, a través de la complementariedad de esquemas de compra y arriendo subsidiado de vivienda y la facilitación del financiamiento formal a los hogares de menores ingresos","ODS 11. Ciudades y comunidades sostenibles","ODS 1. Fin de la pobreza","Dimensión 3. Gestión con Valores para Resultados","Gestión a la Política de Vivienda","Hogares beneficiados con cobertura para adquisición de vivienda","Sumatoria de hogares beneficiados con coberturas a la tasa para adquisición de vivienda de interés prioritario y social otorgadas en el programa de coberturas condicionada para créditos de vivienda segunda generación (FRECH)","Medir el número de hogares beneficiados con cobertura a la tasa para adquisición de vivienda de interés prioritario y social otorgadas en el programa de cobertura condicionada para créditos de vivienda segunda generación (FRECH)","Variable 1 Hogares beneficiados con cobertura de tasa de interés para la financiación de vivienda de interés social nueva para áreas urbanas: el subsidio a la tasa de interés o cobertura condicionada es el beneficio para cubrir condicionadamente un porcentaje de la tasa de interés de los créditos hipotecarios, con el fin de facilitar la adquisición de una vivienda por parte de los hogares colombianos. El subsidio a la tasa de interés del Gobierno Nacional le ayuda a los colombianos a pagar hasta el 30% de la cuota mensual de su crédito hipotecario.",null,"Suma","2018-12-31","Banco de la República ",30,"Mensual","Producto","Número",110711,30000,30000,30000,30000,120000,"DIVIS-Dirección de Inversiones en Vivienda de Interés Social",false,null,{"$f":"AE17/Y17","v":0},"PND",180,"PES","Transversal","III. Pacto por la Equidad: política social moderna centrada en la familia, eficiente, de calidad y conectada a mercados","E. Vivienda y entornos dignos e incluyentes","Objetivo 2. Profundizar el acceso a soluciones de vivienda digna, a través de la complementariedad de esquemas de compra y arriendo subsidiado de vivienda y la facilitación del financiamiento formal a los hogares de menores ingresos","ODS 6. Agua limpia y saneamiento","NO",null,null,null,null,null,null,null,"GRF-Grupo de Recursos Físicos",4,0,4]
["Hogares beneficiados con subsidio familiar para adquisición de vivienda","Vivienda","Aumentar el acceso a vivienda digna","Profundizar el acceso a soluciones de vivienda digna a los hogares de menores ingresos.","III. Pacto por la Equidad: política social moderna centrada en la familia, eficiente, de calidad y conectada a mercados","E. Vivienda y entornos dignos e incluyentes","Objetivo 2. Profundizar el acceso a soluciones de vivienda digna, a través de la complementariedad de esquemas de compra y arriendo subsidiado de vivienda y la facilitación del financiamiento formal a los hogares de menores ingresos","ODS 11. Ciudades y comunidades sostenibles","ODS 1. Fin de la pobreza","Dimensión 3. Gestión con Valores para Resultados","Gestión a la Política de Vivienda","Hogares beneficiados con subsidio familiar para adquisición de vivienda","Sumatoria de hogares beneficiados con subsidio familiar vivienda asginados por fonvivienda","Medir el número de hogares beneficiados con subsidio familiar de vivienda asignados por Fonvivienda","Variable 1 Subsidio familiar vivienda: es un aporte estatal en dinero o en especie entregado por una sola vez al hogar beneficiario, que no se restituye y que constituye un complemento para facilitar la adquisición de vivienda nueva. \n ",null,"Suma","2018-12-31","Sistema de Información del Subsidio Familiar de Vivienda",30,"Mensual","Producto","Número",37732,32311,32689,35000,35000,135000,"DIVIS-Dirección de Inversiones en Vivienda de Interés Social",false,null,{"$f":"AE18/Y18","v":0},"PND",180,null,"Transversal","III. Pacto por la Equidad: política social moderna centrada en la familia, eficiente, de calidad y conectada a mercados","E. Vivienda y entornos dignos e incluyentes","Objetivo 2. Profundizar el acceso a soluciones de vivienda digna, a través de la complementariedad de esquemas de compra y arriendo subsidiado de vivienda y la facilitación del financiamiento formal a los hogares de menores ingresos","ODS 6. Agua limpia y saneamiento","SI",null,null,null,null,null,null,null,"GTH-Grupo de Talento Humano",6,0,6]
["Hogares beneficiados con subsidios para arrendamiento de vivienda de interés social urbana","Vivienda","Aumentar el acceso a vivienda digna","Profundizar el acceso a soluciones de vivienda digna a los hogares de menores ingresos.","III. Pacto por la Equidad: política social moderna centrada en la familia, eficiente, de calidad y conectada a mercados","E. Vivienda y entornos dignos e incluyentes","Objetivo 2. Profundizar el acceso a soluciones de vivienda digna, a través de la complementariedad de esquemas de compra y arriendo subsidiado de vivienda y la facilitación del financiamiento formal a los hogares de menores ingresos","ODS 11. Ciudades y comunidades sostenibles","ODS 1. Fin de la pobreza","Dimensión 3. Gestión con Valores para Resultados","Gestión a la Política de Vivienda","Hogares beneficiados con subsidios para arrendamiento de vivienda de interés social urbana","Sumatoria de hogares beneficiados con subsidios de arrendamiento asignados en el programa de vivienda Semillero de Propietarios y del Fovis","Medir el número de hogares beneficiados con los subsidios asignados para arrendamiento en el Progama de Vivienda Semillero de Popietarios ","Variable 1 Subsidios de arrendamiento asignados: el Subsidio Familiar de Vivienda (SFV), aplicable al canon mensual en contratos de arrendamiento y arrendamiento con opción de compra; es un aporte estatal en dinero, que se otorga por una sola vez al beneficiario y se entrega en forma periódica o anticipada, sin cargo de restitución, destinado a cubrir un porcentaje mensual del canon de arrendamiento que le permita acceder en calidad de arrendatario a una solución de vivienda de interés social o prioritario nueva o usada.",null,"Suma","2018-12-31","Sistema de Información del Subsidio Familiar de Vivienda",30,"Mensual","Producto","Número",0,40000,40000,60000,60000,200000,"DIVIS-Dirección de Inversiones en Vivienda de Interés Social",false,null,{"$f":"AE19/Y19","v":0},"PND",180,"PES","Transversal","III. Pacto por la Equidad: política social moderna centrada en la familia, eficiente, de calidad y conectada a mercados","E. Vivienda y entornos dignos e incluyentes","Objetivo 2. Profundizar el acceso a soluciones de vivienda digna, a través de la complementariedad de esquemas de compra y arriendo subsidiado de vivienda y la facilitación del financiamiento formal a los hogares de menores ingresos","ODS 6. Agua limpia y saneamiento","NO",null,null,null,null,null,null,null,"OAJ-Oficina Asesora Jurídica",6,0,6]
["Porcentaje de subsidios asignados a los hogares víctimas de desplazamiento forzado en los programas de vivienda","Vivienda","Aumentar el acceso a vivienda digna","Profundizar el acceso a soluciones de vivienda digna a los hogares de menores ingresos.","III. Pacto por la Equidad: política social moderna centrada en la familia, eficiente, de calidad y conectada a mercados","E. Vivienda y entornos dignos e incluyentes","Objetivo 2. Profundizar el acceso a soluciones de vivienda digna, a través de la complementariedad de esquemas de compra y arriendo subsidiado de vivienda y la facilitación del financiamiento formal a los hogares de menores ingresos","ODS 11. Ciudades y comunidades sostenibles","ODS 1. Fin de la pobreza","Dimensión 3. Gestión con Valores para Resultados","Gestión a la Política de Vivienda","Porcentaje de subsidios asignados a los hogares víctimas de desplazamiento forzado en los programas de vivienda","(Sumatoria del total de los subsidios asignados a los hogares víctimas de desplazamiento forzado que son beneficiados / Sumatoria del total de hogares beneficiados)*100","Medir el número de subsidios asiganados a los hogares víctimas de desplazamiento forzado","Variable 1 Subsidios asignados a los hogares víctimas de desplazamiento forzado: Hace referencia al número de SFV asignados a hogares víctimas de desplazamiento forzado en los diferentes programas de vivienda que lidera el MVCT","Variable 2 Total de hogares beneficiados: Hace referencia al total de hogares beneficiados con SFV asigando en los diferentes programas de vivienda que lidera el MVCT","Constante","N/D","Sistema de Información del Subsidio Familiar de Vivienda",0,"Mensual","Producto","Porcentaje",50,0,0,50,50,50,"DIVIS-Dirección de Inversiones en Vivienda de Interés Social",false,null,{"$f":"AE20/Y20","v":{"$error":"#DIV/0!"}},"Gestión",180,"PES","Transversal","III. Pacto por la Equidad: política social moderna centrada en la familia, eficiente, de calidad y conectada a mercados","E. Vivienda y entornos dignos e incluyentes","Objetivo 2. Profundizar el acceso a soluciones de vivienda digna, a través de la complementariedad de esquemas de compra y arriendo subsidiado de vivienda y la facilitación del financiamiento formal a los hogares de menores ingresos","ODS 6. Agua limpia y saneamiento","NO",null,null,null,null,null,null,null,"OAP-Oficina Asesora de Planeación ",7,0,7]
["Subsidios en especie de vivienda de interés social rural asignados a familias de las comunidades indígenas Nukak y Jiw","Vivienda","Aumentar el acceso a vivienda digna","Profundizar el acceso a soluciones de vivienda digna a los hogares de menores ingresos.","XII. Pacto por la equidad de oportunidades para grupos étnicos: Indígenas, Negros, Afrocolombianos, Raizales, Palenqueros y Rrom","B. Capítulo de grupos indígenas","Objetivo 2. Profundizar el acceso a soluciones de vivienda digna, a través de la complementariedad de esquemas de compra y arriendo subsidiado de vivienda y la facilitación del financiamiento formal a los hogares de menores ingresos","ODS 11. Ciudades y comunidades sostenibles","ODS 1. Fin de la pobreza","Dimensión 3. Gestión con Valores para Resultados","Gestión a la Política de Vivienda","Subsidios en especie de vivienda de interés social rural asignados a familias de las comunidades indígenas Nukak y Jiw","\nSumatoria de subsidios en especie de vivienda de interés social rural asignados a familias de las comunidades indígenas Nukak y Jiw\n","Medir el número de subsidios familiares para la construccion de las tipologías de vivienda concertadas","Variable 1 Subsidios en especie de vivienda de interés social rural: Es un aporte en dinero o en especie que el estado entrega por una sola vez al hogar beneficiario, con el objeto de facilitarle una solución de vivienda de interés social rural, sin cargo de restitución. Se asignarán subsidios familiares de vivienda para la construccion de las tipologías de vivienda concertadas",null,"Creciente","N/D","Dirección de Vivienda Rural, Dirección de Inversiones de Vivienda de Interés Social - Ministerio de Vivienda, Ciudad y Territorio y FONVIVIENDA",0,"Anual","Producto","Número","N/D",0,0,40,40,80,"DIVIS-Dirección de Inversiones en Vivienda de Interés Social",false,null,null,"PND",null,"PES","Transversal","XII. Pacto por la equidad de oportunidades para grupos étnicos: Indígenas, Negros, Afrocolombianos, Raizales, Palenqueros y Rrom","B. Capítulo de grupos indígenas","Objetivo 2. Profundizar el acceso a soluciones de vivienda digna, a través de la complementariedad de esquemas de compra y arriendo subsidiado de vivienda y la facilitación del financiamiento formal a los hogares de menores ingresos",null,null,null,null,null,null,null,null,null,"OCI-Oficina de Control Interno",1,0,1]
["Subsidios Familiares de Vivienda Entregados a Mujeres Cabeza de Familia","Vivienda","Aumentar el acceso a vivienda digna","Profundizar el acceso a soluciones de vivienda digna a los hogares de menores ingresos.","XIV. Pacto de equidad para las mujeres","C. El cuidado, una apuesta de articulación y corresponsabilidad","Objetivo 2. Generar lineamientos de articulación de la oferta de programas disponible a nivel territorial con enfoque de género para las mujeres para reducir las cargas de cuidado de las mujeres","ODS 5. Igualdad de género","ODS 1. Fin de la pobreza","Dimensión 3. Gestión con Valores para Resultados","Gestión a la Política de Vivienda","Subsidios Familiares de Vivienda Entregados a Mujeres Cabeza de Familia","Sumatoria de los subsidios familiares de vivienda asignados a las mujeres cabeza de familia en los programas de vivienda mi casa ya, semillero de propietarios, casa digna vida digna","Medir el número de subsidios familiares de vivienda asignados a mujeres cabeza de familia en los Progamas de Vivienda de Mi Casa Ya, Semillero de Propietarios y Casa Digna Vida Digna","Variable 1 Subsidios asignados a mujeres cabeza de familia: corresponde a los subsidios  familiares de vivienda asigandos u otorgados a los hogares cuya cabeza o jefe es una mujer",null,"Suma","2018-12-31","Sistema de Información del Subsidio Familiar de Vivienda",30,"Mensual","Producto","Número",24700,5000,10000,25000,31820,71820,"DIVIS-Dirección de Inversiones en Vivienda de Interés Social",false,null,null,"PND",null,null,"Transversal","XIV. Pacto de equidad para las mujeres","C. El cuidado, una apuesta de articulación y corresponsabilidad","Objetivo 2. Generar lineamientos de articulación de la oferta de programas disponible a nivel territorial con enfoque de género para las mujeres para reducir las cargas de cuidado de las mujeres",null,null,null,null,null,null,null,null,null,"OTIC-Oficina de Tecnologías de Información y Comunicaciones ",3,1,2]
["Subsidios para mejoramiento de vivienda rural asignados a indígenas Nukak y Jiw","Vivienda","Aumentar el acceso a vivienda digna","Profundizar el acceso a soluciones de vivienda digna a los hogares de menores ingresos.","XII. Pacto por la equidad de oportunidades para grupos étnicos: Indígenas, Negros, Afrocolombianos, Raizales, Palenqueros y Rrom","B. Capítulo de grupos indígenas","Objetivo 1. Mejorar las condiciones físicas y sociales de viviendas, entornos y aglomeraciones humanas de desarrollo incompleto","ODS 11. Ciudades y comunidades sostenibles","ODS 1. Fin de la pobreza","Dimensión 3. Gestión con Valores para Resultados","Gestión a la Política de Vivienda","Subsidios para mejoramiento de vivienda rural asignados a indígenas Nukak y Jiw","Sumatoria de subsidios para mejoramiento de vivienda rural asignados a familias de las comunidades indígenas Nukak y Jiw","Medir el número de subsidios familiares para mejoramiento de vivienda asignados a la población focalizada","Variable 1 Subsidios para mejoramiento de vivienda rural: Se entregarán subsidios familiares para mejoramiento de vivienda a la población focalizada. Se considera un mejoramiento de vivienda rural el conjunto de acciones integrales que permiten dignificar las condiciones de vida de un familia u hogar rural, teniendo en cuenta lo relacionado con salud habitacional y las adecuaciones estructurales o locativas en unidades sanitarias, piso, cocina, habitación, eliminación de excretas y sistemas de almacenamiento de agua; estas serán entregadas a los beneficiarios del Subsidio Familiar de Vivienda de Interés Social Rural, mediante acta, a través de la entidad operadora o contratista, documento que será cuantificado para el indicador cuando sea reportado a la entidad y validado.",null,"Creciente","N/D","Dirección de Vivienda Rural, Dirección de Inversiones de Vivienda de Interés Social - Ministerio de Vivienda, Ciudad y Territorio y FONVIVIENDA",0,"Anual","Producto","Número","N/D",0,0,20,20,40,"DIVIS-Dirección de Inversiones en Vivienda de Interés Social",false,null,null,"PND",null,"PES","Transversal","XII. Pacto por la equidad de oportunidades para grupos étnicos: Indígenas, Negros, Afrocolombianos, Raizales, Palenqueros y Rrom","B. Capítulo de grupos indígenas","Objetivo 1. Mejorar las condiciones físicas y sociales de viviendas, entornos y aglomeraciones humanas de desarrollo incompleto",null,null,null,null,null,null,null,null,null,"SFP-Subdirección de Finanzas y Presupuesto",3,0,3]
["Viviendas de Interés social rural construidas","Vivienda","Aumentar el acceso a vivienda digna","Profundizar el acceso a soluciones de vivienda digna a los hogares de menores ingresos.","III. Pacto por la equidad: política social moderna centrada en la familia, eficiente, de calidad y conectada a mercados","E. Vivienda y entornos dignos e incluyentes","Objetivo 2. Profundizar el acceso a soluciones de vivienda digna, a través de la complementariedad de esquemas de compra y arriendo subsidiado de vivienda y la facilitación del financiamiento formal a los hogares de menores ingresos","ODS 11. Ciudades y comunidades sostenibles","ODS 1. Fin de la pobreza","Dimensión 3. Gestión con Valores para Resultados","Gestión a la Política de Vivienda","Viviendas de Interés social rural construidas","Sumatorias de viviendas de interés social rural nuevas entregadas","Medir el número de hogares rurales beneficiados con viviendas de interés social rural nuevas entregadas en el territorio nacional","Variable 1 Viviendas de interés social rural nuevas entregadas: Se entiende por vivienda nueva rural a la construcción de una solución habitacional que tendrá un área en metros cuadrados, establecida y determinada por la reglamentación del programa del MVCT y la tipología a construir reconociendo variables climáticas, socioculturales y geográficas, entre otros factores. La vivienda contará con espacio múltiple, baño, cocina, habitaciones y saneamiento básico. Las viviendas serán entregadas a los beneficiarios del Subsidio Familiar de Vivienda de Interés Social Rural, mediante acta, a través de la entidad operadora o contratista, documento que será cuantificado para el indicador cuando sea reportado a la entidad y validado.",null,"Suma","2018-12-31","Dirección de Vivienda Rural, Dirección de Inversiones de Vivienda de Interés Social - Ministerio de Vivienda, Ciudad y Territorio y FONVIVIENDA",30,"Mensual","Producto","Número","N/D",0,0,3884,6415,10299,"DIVIS-Dirección de Inversiones en Vivienda de Interés Social",false,null,null,"PND",30,"PES","Transversal","III. Pacto por la equidad: política social moderna centrada en la familia, eficiente, de calidad y conectada a mercados","E. Vivienda y entornos dignos e incluyentes","Objetivo 2. Profundizar el acceso a soluciones de vivienda digna, a través de la complementariedad de esquemas de compra y arriendo subsidiado de vivienda y la facilitación del financiamiento formal a los hogares de menores ingresos","ODS 11. Ciudades y comunidades sostenibles","NO",null,null,null,null,null,null,null,"SSA-Subdirección de Servicios Administrativos",2,0,2]
["Viviendas de Interés Social Rural mejoradas","Vivienda","Aumentar el acceso a vivienda digna","Profundizar el acceso a soluciones de vivienda digna a los hogares de menores ingresos.","III. Pacto por la Equidad: política social moderna centrada en la familia, eficiente, de calidad y conectada a mercados","E. Vivienda y entornos dignos e incluyentes","Objetivo 1. Mejorar las condiciones físicas y sociales de viviendas, entornos y asentamientos precarios, a través de la implementación de políticas para el mejoramiento de vivienda y barrios para los hogares de menores ingresos","ODS 11. Ciudades y comunidades sostenibles","ODS 1. Fin de la pobreza","Dimensión 3. Gestión con Valores para Resultados","Gestión a la Política de Vivienda","Viviendas de Interés Social Rural mejoradas","Sumatoria de viviendas mejoradas entregadas","Medir el número de hogares rurales beneficiados con mejoramientos de vivienda entregados en el territorio nacional","Variable 1 Viviendas mejoradas entregadas: Se considera un mejoramiento de vivienda rural el conjunto de acciones integrales que permiten dignificar las condiciones de vida de un familia u hogar rural, teniendo en cuenta lo relacionado con salud habitacional y las adecuaciones estructurales o locativas en unidades sanitarias, piso, cocina, habitación, eliminación de excretas y sistemas de almacenamiento de agua; estas serán entregadas a los beneficiarios del Subsidio Familiar de Vivienda de Interés Social Rural, mediante acta, a través de la entidad operadora o contratista, documento que será cuantificado para el indicador cuando sea reportado a la entidad y validado.",null,"Suma","2018-12-31","Dirección de Vivienda Rural, Dirección de Inversiones de Vivienda de Interés Social - Ministerio de Vivienda, Ciudad y Territorio y FONVIVIENDA",30,"Mensual","Producto","Número","N/D",0,50,13567,12883,26500,"DIVIS-Dirección de Inversiones en Vivienda de Interés Social",false,null,null,"PND",null,"PES","Transversal","III. Pacto por la Equidad: política social moderna centrada en la familia, eficiente, de calidad y conectada a mercados","E. Vivienda y entornos dignos e incluyentes","Objetivo 1. Mejorar las condiciones físicas y sociales de viviendas, entornos y asentamientos precarios, a través de la implementación de políticas para el mejoramiento de vivienda y barrios para los hogares de menores ingresos"]
["Viviendas de interés social urbanas mejoradas (Fonvivienda)","Vivienda","Aumentar el acceso a vivienda digna","Mejorar las condiciones físicas y sociales de viviendas, entornos y aglomeraciones humanas de desarrollo incompleto","III. Pacto por la Equidad: política social moderna centrada en la familia, eficiente, de calidad y conectada a mercados","E. Vivienda y entornos dignos e incluyentes","Objetivo 1.  Mejorar las condiciones físicas y sociales de viviendas, entornos y aglomeraciones humanas de desarrollo incompleto","ODS 11. Ciudades y comunidades sostenibles","ODS 1. Fin de la pobreza","Dimensión 3. Gestión con Valores para Resultados","Gestión a la Política de Vivienda","Viviendas de interés social urbanas mejoradas (Fonvivienda)","Sumatoria de viviendas de interés social urbanas mejoradas a través de subsidios asignados por Fonvivienda ","Medir el número de viviendas mejoradas reportadas en las bases de datos del Ministerio de Vivienda, Fonvivienda, cajas de compensación, municipios, Distritos y gobernaciones (mediante certificado de existencia para el Ministerio de Vivienda y Fonvivienda, resoluciones o actas de entrega para las cajas de compensación, distritos, municipios y gobernaciones).","Variable 1 Subsidios asignados para mejoramientos de viviendas: el subsidio de mejoramiento es el beneficio que otorga el Gobierno Nacional, los entes territoriales y las CCF a cada hogar para el mejoramiento de su vivienda y está dirigido a la población que presenta carencias habitacionales recuperables a través de mejoras en los inmuebles.\nMejoramiento de Vivienda:  Proceso por el cual el beneficiario del subsidio supera una o varias de las carencias básicas de una vivienda perteneciente a un desarrollo legal o legalizado, o a una edificación, en aspectos tales como, su estructura principal, cimientos, muros o cubiertas, carencia o vetustez de redes eléctricas o de acueducto, y cuyo desarrollo exige la consecución de permisos o licencias previos ante las autoridades competentes. ",null,"Suma","2018-12-31","Dirección de Inversiones en Vivienda de Interés Social (DIVIS), CCF y entes territoriales ",0,"Mensual","Producto","Número",8219,27516,26622,29247,29205,112590,"DIVIS-Dirección de Inversiones en Vivienda de Interés Social",false,null,null,"PND",0,null,"Transversal","III. Pacto por la Equidad: política social moderna centrada en la familia, eficiente, de calidad y conectada a mercados","E. Vivienda y entornos dignos e incluyentes","Objetivo 1.  Mejorar las condiciones físicas y sociales de viviendas, entornos y aglomeraciones humanas de desarrollo incompleto","ODS 11. Ciudades y comunidades sostenibles","NO"]
["Viviendas mejoradas entregadas a mujeres","Vivienda","Aumentar el acceso a vivienda digna","Mejorar las condiciones físicas y sociales de viviendas, entornos y aglomeraciones humanas de desarrollo incompleto","XIV. Pacto de equidad para las mujeres","E. Vivienda y entornos dignos e incluyentes","Objetivo 1. Mejorar las condiciones físicas y sociales de viviendas, entornos y asentamientos precarios, a través de la implementación de políticas para el mejoramiento de vivienda y barrios para los hogares de menores ingresos","ODS 11. Ciudades y comunidades sostenibles","ODS 1. Fin de la pobreza","Dimensión 3. Gestión con Valores para Resultados","Gestión a la Política de Vivienda","Viviendas mejoradas entregadas a mujeres","Sumatoria de viviendas mejoradas entregadas a hogares con jefatura femenina","Medir el número de hogares rurales con jefatura femenina beneficiados con mejoramiento de viviendas de interés social rural entregados en el territorio nacional, incluyendo los municipios PDET","Variable 1 Viviendas mejoradas entregadas a hogares con jefatura femenina: El Subsidio Familiar de Vivienda Rural (SFVR) se otorga de acuerdo con lo establecido en el Decreto 1341 de 2020. Se considera un mejoramiento de vivienda rural, el conjunto de acciones integrales que permiten dignificar las condiciones de vida de un familia u hogar rural, teniendo en cuenta lo relacionado con salud habitacional y las adecuaciones locativas o modulares que no superen los 22 SMMLV y que estén acordes con lo definido en los portafolios de mejoramientos establecidos en el numeral 6.3.2 del Plan Nacional de Construcción y Mejoramiento de Vivienda Social Rural. Las viviendas mejoradas serán entregadas a los beneficiarios del Subsidio Familiar de Vivienda de Interés Social Rural, mediante acta, a través de la entidad operadora o contratista, documento que será cuantificado para el indicador cuando sea reportado a la entidad y validado. Este indicador está sujeto a la asignación presupuestal anual del respectivo proyecto de inversión. La importancia de este indicador reside en la necesidad de medir y hacer seguimiento a las acciones implementadas para la reducción del déficit cualitativo de vivienda en el área rural y la reducción de la brecha de género.",null,"Suma","N/D","Dirección de Vivienda Rural, Dirección de Inversiones de Vivienda de Interés Social - Ministerio de Vivienda, Ciudad y Territorio y FONVIVIENDA",30,"Mensual","Producto","Número","N/D",0,0,477,8798,9275,"DIVIS-Dirección de Inversiones en Vivienda de Interés Social",false,null,null,"Gestión",null,null,"Estructural ","XIV. Pacto de equidad para las mujeres","E. Vivienda y entornos dignos e incluyentes","Objetivo 1. Mejorar las condiciones físicas y sociales de viviendas, entornos y asentamientos precarios, a través de la implementación de políticas para el mejoramiento de vivienda y barrios para los hogares de menores ingresos"]
["Viviendas mejoradas entregadas en municipios PDET","Vivienda","Aumentar el acceso a vivienda digna","Mejorar las condiciones físicas y sociales de viviendas, entornos y aglomeraciones humanas de desarrollo incompleto","III. Pacto por la Equidad: política social moderna centrada en la familia, eficiente, de calidad y conectada a mercados","E. Vivienda y entornos dignos e incluyentes","Objetivo 1. Mejorar las condiciones físicas y sociales de viviendas, entornos y asentamientos precarios, a través de la implementación de políticas para el mejoramiento de vivienda y barrios para los hogares de menores ingresos","ODS 11. Ciudades y comunidades sostenibles","ODS 1. Fin de la pobreza","Dimensión 3. Gestión con Valores para Resultados","Gestión a la Política de Vivienda","Viviendas mejoradas entregadas en municipios PDET","Sumatoria de viviendas mejoradas entregadas en municipios PDET","Medir el número de hogares rurales beneficiados con mejoramiento de viviendas de interés social rural entregados en el área rural de los municipios PDET","Variable 1 Viviendas mejoradas entregadas en municipios PDET: El Subsidio Familiar de Vivienda Rural (SFVR) se otorga de acuerdo con lo establecido en el Decreto 1341 de 2020. Se considera un mejoramiento de vivienda rural, el conjunto de acciones integrales que permiten dignificar las condiciones de vida de un familia u hogar rural, teniendo en cuenta lo relacionado con salud habitacional y las adecuaciones locativas o modulares que no superen los 22 SMMLV y que estén acordes con lo definido en los portafolios de mejoramientos establecidos en el numeral 6.3.2 del Plan Nacional de Construcción y Mejoramiento de Vivienda Social Rural. Las viviendas mejoradas serán entregadas a los beneficiarios del Subsidio Familiar de Vivienda de Interés Social Rural en los municipios PDET, mediante acta, a través de la entidad operadora o contratista, documento que será cuantificado para el indicador cuando sea reportado a la entidad y validado. Este indicador está sujeto a la asignación presupuestal anual del respectivo proyecto de inversión. La importancia de este indicador reside en la\nnecesidad de medir y hacer seguimiento a las acciones implementadas para la reducción del déficit cualitativo de vivienda en el área rural.",null,"Suma","N/D","Dirección de Vivienda Rural, Dirección de Inversiones de Vivienda de Interés Social - Ministerio de Vivienda, Ciudad y Territorio y FONVIVIENDA",30,"Mensual","Producto","Número","N/D",0,0,0,6508,6508,"DIVIS-Dirección de Inversiones en Vivienda de Interés Social",false,null,null,"Gestión",null,null,"Estructural ","III. Pacto por la Equidad: política social moderna centrada en la familia, eficiente, de calidad y conectada a mercados","E. Vivienda y entornos dignos e incluyentes","Objetivo 1. Mejorar las condiciones físicas y sociales de viviendas, entornos y asentamientos precarios, a través de la implementación de políticas para el mejoramiento de vivienda y barrios para los hogares de menores ingresos"]
["Viviendas nuevas entregadas a mujeres","Vivienda","Aumentar el acceso a vivienda digna","Profundizar el acceso a soluciones de vivienda digna a los hogares de menores ingresos.","XIV. Pacto de equidad para las mujeres","E. Vivienda y entornos dignos e incluyentes","Objetivo 2. Profundizar el acceso a soluciones de vivienda digna, a través de la complementariedad de esquemas de compra y arriendo subsidiado de vivienda y la facilitación del financiamiento formal a los hogares de menores ingresos","ODS 11. Ciudades y comunidades sostenibles","ODS 1. Fin de la pobreza","Dimensión 3. Gestión con Valores para Resultados","Gestión a la Política de Vivienda","Viviendas nuevas entregadas a mujeres","Sumatoria de viviendas de interés social rural nuevas entregadas a hogares con jefatura femenina","Medir el número de hogares rurales con jefatura femenina beneficiados con viviendas de interés social rural nuevas entregadas en el área rural del territorio nacional, incluyendo los municipios PDET. ","Variable 1 Viviendas de interés social rural nuevas entregadas a hogares con jefatura femenina: El Subsidio Familiar de Vivienda Rural (SFVR) se otorga de acuerdo con lo establecido en el Decreto 1341 de 2020. Se entiende por vivienda nueva la construcción de una solución habitacional definida mediante una tipología de vivienda a construir y que reconociendo variables climáticas, socioculturales y geográficas, entre otros factores, cuente con los siguientes espacios: un (1) espacio múltiple, tres (3) habitaciones, un (1) baño, una (1) cocina, (1) un cuarto de herramientas, una (1) alberca para el almacenamiento de agua y limpieza, una (1) solución de saneamiento básico incluyendo aparatos e instalaciones hidráulicas y sanitarias y finalmente, una (1) solución de manejo de excretas y/o aguas residuales domésticas, salvo para el caso de la población indígena, la solución de manejo de excretas y de saneamiento básico tendrá en cuenta los usos y costumbres dependiendo de la población. Las viviendas serán entregadas a mujeres beneficiarias del Subsidio Familiar de Vivienda de Interés Social Rural, mediante acta, a través de la entidad operadora o contratista, documento que será cuantificado para el indicador cuando sea reportado a la entidad y validado. Este indicador está sujeto a la asignación presupuestal anual del respectivo proyecto de inversión. La importancia de este indicador reside en la necesidad de medir y hacer seguimiento a las acciones implementadas para la reducción del déficit cuantitativo de vivienda en el sector rural y la reducción de la brecha de género.",null,"Suma","N/D","Dirección de Vivienda Rural, Dirección de Inversiones de Vivienda de Interés Social - Ministerio de Vivienda, Ciudad y Territorio y FONVIVIENDA",30,"Mensual","Producto","Número","N/D",0,0,1943,1456,3399,"DIVIS-Dirección de Inversiones en Vivienda de Interés Social",false,null,null,"Gestión",null,null,"Estructural ","XIV. Pacto de equidad para las mujeres","E. Vivienda y entornos dignos e incluyentes","Objetivo 2. Profundizar el acceso a soluciones de vivienda digna, a través de la complementariedad de esquemas de compra y arriendo subsidiado de vivienda y la facilitación del financiamiento formal a los hogares de menores ingresos"]
["Viviendas nuevas entregadas en municipios PDET","Vivienda","Aumentar el acceso a vivienda digna","Profundizar el acceso a soluciones de vivienda digna a los hogares de menores ingresos.","III. Pacto por la Equidad: política social moderna centrada en la familia, eficiente, de calidad y conectada a mercados","E. Vivienda y entornos dignos e incluyentes","Objetivo 2. Profundizar el acceso a soluciones de vivienda digna, a través de la complementariedad de esquemas de compra y arriendo subsidiado de vivienda y la facilitación del financiamiento formal a los hogares de menores ingresos","ODS 11. Ciudades y comunidades sostenibles","ODS 1. Fin de la pobreza","Dimensión 3. Gestión con Valores para Resultados","Gestión a la Política de Vivienda","Viviendas nuevas entregadas en municipios PDET","Sumatoria de viviendas de interés social rural nuevas entregadas en municipios PDET","Medir el número de hogares rurales beneficiados con viviendas de interés social rural nuevas entregadas en el área rural de los municipios PDET","Variable 1 Viviendas de interés social rural nuevas entregadas en municipios PDET: El Subsidio Familiar de Vivienda Rural (SFVR) se otorga de acuerdo con lo establecido en el Decreto 1341 de 2020. Se entiende por vivienda nueva la construcción de una solución habitacional definida mediante una tipología de vivienda a construir y que reconociendo variables climáticas, socioculturales y geográficas, entre otros factores, cuente con los siguientes espacios: un (1) espacio múltiple, tres (3) habitaciones, un (1) baño, una (1) cocina, (1) un cuarto de herramientas, una (1) alberca para el almacenamiento de agua y limpieza, una (1) solución de saneamiento básico incluyendo aparatos e instalaciones hidráulicas y sanitarias y finalmente, una (1) solución de manejo de excretas y/o aguas residuales domésticas, salvo para el caso de la población indígena, la solución de manejo de excretas y de saneamiento básico tendrá en cuenta los usos y costumbres dependiendo de la población. Las viviendas serán entregadas a los beneficiarios del Subsidio Familiar de Vivienda de Interés Social Rural, mediante acta, a través de la entidad operadora o contratista, documento que será cuantificado para el indicador cuando sea reportado a la entidad y validado. Este indicador está sujeto a la asignación presupuestal anual del respectivo proyecto de inversión. La importancia de este indicador reside en la necesidad de medir y hacer seguimiento a las acciones implementadas para la reducción del déficit cuantitativo de vivienda en el sector rural en los municipios PDET.",null,"Suma","N/D","Dirección de Vivienda Rural, Dirección de Inversiones de Vivienda de Interés Social - Ministerio de Vivienda, Ciudad y Territorio y FONVIVIENDA",30,"Mensual","Producto","Número","N/D",0,0,1758,0,1758,"DIVIS-Dirección de Inversiones en Vivienda de Interés Social",false,null,null,"Gestión",null,null,"Estructural ","III. Pacto por la Equidad: política social moderna centrada en la familia, eficiente, de calidad y conectada a mercados","E. Vivienda y entornos dignos e incluyentes","Objetivo 2. Profundizar el acceso a soluciones de vivienda digna, a través de la complementariedad de esquemas de compra y arriendo subsidiado de vivienda y la facilitación del financiamiento formal a los hogares de menores ingresos"]
["Porcentaje de  compromisos adquiridos a los que se les hace seguimiento","Institucional","Robustecer la capacidad de gestión y desempeño de las entidades del sector","Fortalecer los estándares de transparencia y diálogo con la ciudadanía y los grupos de valor","I. Pacto por la legalidad: seguridad efectiva y justicia transparente para que todos vivamos con libertad y en democracia","C. Alianza contra la corrupción: tolerancia cero con los corruptos","Objetivo 1. Pacto de cero tolerancia a la corrupción y a la falta de transparencia","ODS 16. Paz, justicia e instituciones sólidas","-","Dimensión 5.  Información y Comunicación ","Relaciones Estratégicas ","Porcentaje de  compromisos adquiridos a los que se les hace seguimiento","(Número de compromisos a los que se hace seguimiento/Número de compromisos adquiridos)*100","Establecer un mecanismo para medir el desempeno de la gestión y seguimiento de los compromisos del Ministro y los proyectos misionales ","Variable 1 Compromisos con seguimiento:  número de compromisos para los que se desarrolló un esquema de seguimiento","Variable 2 Compromisos adquiridos: número de compromisos adquiridos por el ministro y aquellos relacionados con los proyectos misionales","Constante","NA","Informe de compromisos del despacho","NA","Trimestral","Eficacia ","Porcentaje","N/D",90,90,90,90,90,"DM-Despacho de Ministro",false,null,null,"Gestión",null,null,"Estructural ","I. Pacto por la legalidad: seguridad efectiva y justicia transparente para que todos vivamos con libertad y en democracia","C. Alianza contra la corrupción: tolerancia cero con los corruptos","Objetivo 1. Pacto de cero tolerancia a la corrupción y a la falta de transparencia"]
["Porcentaje de integrantes del sector político (congresistas, entes territoriales) atendidos","Institucional","Robustecer la capacidad de gestión y desempeño de las entidades del sector","Fortalecer los estándares de transparencia y diálogo con la ciudadanía y los grupos de valor","I. Pacto por la legalidad: seguridad efectiva y justicia transparente para que todos vivamos con libertad y en democracia","C. Alianza contra la corrupción: tolerancia cero con los corruptos","Objetivo 1. Pacto de cero tolerancia a la corrupción y a la falta de transparencia","ODS 16. Paz, justicia e instituciones sólidas","ODS 17. Alianzas para lograr los objetivos","Dimensión 2. Direccionamiento Estratégico y Planeación ","Relaciones Estratégicas ","Porcentaje de integrantes del sector político (congresistas, entes territoriales) atendidos","(Número de integrantes del sector político atendidos/Número de solicitud de citas)*100","Atender a los integrantes del sector político con el fin de cumplir con la normatividad vigente y dar conocer las políticas, planes y programas de la entidad mediante la Oferta Institucional","Variable 1 Integrantes del sector político atendidos: son las atenciones que se realizan a los integrantes del sector político de acuerdo con su solicitud","Variable 2 Solicitud de citas: son las audiencias que solicitan los integrantes del sector político con el Ministro, Viceministros y personal de Agenda Legislativa","Constante","2018-12-20","Agenda legislativa","NA","Mensual","Eficacia ","Porcentaje",81,100,100,100,100,100,"DM-Despacho de Ministro",false,null,null,"Gestión",null,null,"Estructural ","I. Pacto por la legalidad: seguridad efectiva y justicia transparente para que todos vivamos con libertad y en democracia","C. Alianza contra la corrupción: tolerancia cero con los corruptos","Objetivo 1. Pacto de cero tolerancia a la corrupción y a la falta de transparencia"]
["Porcentaje de proyectos de ley con postura del Ministerio","Institucional","Robustecer la capacidad de gestión y desempeño de las entidades del sector","Fortalecer los estándares de transparencia y diálogo con la ciudadanía y los grupos de valor","I. Pacto por la legalidad: seguridad efectiva y justicia transparente para que todos vivamos con libertad y en democracia","C. Alianza contra la corrupción: tolerancia cero con los corruptos","Objetivo 1. Pacto de cero tolerancia a la corrupción y a la falta de transparencia","ODS 16. Paz, justicia e instituciones sólidas","ODS 17. Alianzas para lograr los objetivos","Dimensión 2. Direccionamiento Estratégico y Planeación ","Relaciones Estratégicas ","Porcentaje de proyectos de ley con postura del Ministerio","(Número de proyectos de ley con postura del Ministerio/Número de proyectos de ley del Ministerio enviados a conceptuar)*100","Identificar iniciativas legislativas radicadas en el Congreso de la República que sean de interés del Ministerio, para definir la posición de la entidad a través de la emisión del concepto por parte de las áreas","Variable 1 Proyectos de ley con postura del Ministerio: son las iniciativas legislativas de interés del MVCT que conceptuó por escrito o que sentó una postura en las distintas comisiones o plenarias de las dos cámaras","Variable 2 Proyectos de ley del Ministerio enviados a conceptuar: son las iniciativas legislativas que se radican en el Congreso y que son de interés del MVCT","Creciente","2018-10-31","Congreso de la República y las dependencias del MVCT","NA","Anual","Eficacia ","Porcentaje",65,80,80,80,90,90,"DM-Despacho de Ministro",false,null,null,"Gestión",90,null,"Transversal","I. Pacto por la legalidad: seguridad efectiva y justicia transparente para que todos vivamos con libertad y en democracia","C. Alianza contra la corrupción: tolerancia cero con los corruptos","Objetivo 1. Pacto de cero tolerancia a la corrupción y a la falta de transparencia","ODS 6. Agua limpia y saneamiento","NO"]
["Porcentaje de relaciones formalizadas con cooperantes","Institucional","Robustecer la capacidad de gestión y desempeño de las entidades del sector","Fortalecer los estándares de transparencia y diálogo con la ciudadanía y los grupos de valor","I. Pacto por la legalidad: seguridad efectiva y justicia transparente para que todos vivamos con libertad y en democracia","D. Colombia en la escena global: política exterior responsable, innovadora y constructiva","Objetivo 1. Participación activa y liderazgo en la gobernanza de los grandes temas y desafíos de la agenda global que afectan a Colombia, y apuesta por el multilateralismo en defensa de la paz, la seguridad y la democracia","ODS 17. Alianza para lograr los objetivos","ODS 11. Ciudades y comunidades sostenibles","Dimensión 2. Direccionamiento Estratégico y Planeación ","Relaciones Estratégicas ","Porcentaje de relaciones formalizadas con cooperantes","(Número de relaciones formalizadas con cooperantes/Número de cooperantes que participan en proyectos del Ministerio)*100","Garantizar el cumplimiento de los compromisos de los cooperantes en el marco de los programas y proyectos del Ministerio de Vivienda, Ciudad y Territorio","Variable 1: Relaciones formalizadas con cooperantes: son instrumentos formales los convenios, memorandos de entendimiento, acuerdos, contratos, entre otros, firmados entre el Ministerio y otra(s) parte(s) que impliquen la consecución de las metas y objetivos misionales del Ministerio.","Variable 2: Cooperantes: cantidad de actores externos que aportan recursos físicos y humanos en proyectos del Ministerio.","Creciente","NA","Reporte realizado por el Despacho del Ministro","NA","Trimestral","Eficiencia","Porcentaje","N/D",60,75,90,100,100,"DM-Despacho de Ministro",false,null,null,"Gestión",30,"PES","Estructural","I. Pacto por la legalidad: seguridad efectiva y justicia transparente para que todos vivamos con libertad y en democracia","D. Colombia en la escena global: política exterior responsable, innovadora y constructiva","Objetivo 1. Participación activa y liderazgo en la gobernanza de los grandes temas y desafíos de la agenda global que afectan a Colombia, y apuesta por el multilateralismo en defensa de la paz, la seguridad y la democracia","ODS 6. Agua limpia y saneamiento","NO"]
["Porcentaje de solicitudes respondidas","Institucional","Robustecer la capacidad de gestión y desempeño de las entidades del sector","Fortalecer los estándares de transparencia y diálogo con la ciudadanía y los grupos de valor","I. Pacto por la legalidad: seguridad efectiva y justicia transparente para que todos vivamos con libertad y en democracia","C. Alianza contra la corrupción: tolerancia cero con los corruptos","Objetivo 1. Pacto de cero tolerancia a la corrupción y a la falta de transparencia","ODS 16. Paz, justicia e instituciones sólidas","ODS 17. Alianzas para lograr los objetivos","Dimensión 2. Direccionamiento Estratégico y Planeación ","Relaciones Estratégicas ","Porcentaje de solicitudes respondidas","(Número de solicitudes formales respondidas/Número de solicitudes formales radicadas)*100","Tramitar con las áreas del Ministerio la respuesta a solicitudes formales (Art. 258 y 260 Ley 5º de 1992) remitidas por Congresistas, con el fin de fortalecer las relaciones del MVCT con el sector político","Variable 1. Solicitudes formales respondidas: son las respuestas emitidas por las áreas a las solicitudes que son radicadas por parte del Congreso de la República en el MVCT.","Variable 2. Solicitudes formales radicadas: son todas las solicitudes radicadas en MVCT por parte del Congreso de la República.","Constante","2018-12-31","Dependencias del MVCT encargadas de emitir la respuesta las que se incluyen en el Formato Solicitudes de Información de Congresistas","NA","Mensual","Eficacia ","Porcentaje",75,90,90,90,90,90,"DM-Despacho de Ministro",false,null,null,"Gestión",0,"PES","Estructural","I. Pacto por la legalidad: seguridad efectiva y justicia transparente para que todos vivamos con libertad y en democracia","C. Alianza contra la corrupción: tolerancia cero con los corruptos","Objetivo 1. Pacto de cero tolerancia a la corrupción y a la falta de transparencia","ODS 11. Ciudades y comunidades sostenibles","SI"]
["Diagnóstico de las condiciones de acceso a agua potable y saneamiento básico concertado con las comunidades indígenas realizado","Agua Potable y Saneamiento Básico","Mejorar la cobertura, calidad y continuidad de los servicios de Agua Potable y Saneamiento Básico","Aumentar coberturas de acueducto y alcantarillado en zonas rurales y zonas urbanas con grandes brechas","XII. Pacto por la equidad de oportunidades para grupos étnicos: Indígenas, Negros, Afrocolombianos, Raizales, Palenqueros y Rrom","B. Capítulo de grupos indígenas","Objetivo 7. Disminuir la brecha entre la población étnica y no\nétnica, en términos de acceso a los servicios de agua y saneamiento\nbásico de alta calidad, a través de la implementación de esquemas\ndiferenciales y de soluciones acordes con las características\nlocales y sociales de la población étnica.","ODS 11. Ciudades y comunidades sostenibles","-","Dimensión 2. Direccionamiento Estratégico y Planeación ","Gestión a la Política de Agua Potable y Saneamiento Básico","Diagnóstico de las condiciones de acceso a agua potable y saneamiento básico concertado con las comunidades indígenas realizado","Sumatoria de diagnósticos de comunidades indígenas","Realizar un diagnóstico de condiciones de acceso a agua potable y saneamiento básico con base en los formularios generados de la plataforma SIASAR para comunidades indígenas","Variable 1 Diagnósticos : corresponde al diagnósticos de comunidades indígenas realizado",null,"Suma","2018-12-31","Dirección de Política y Regulación (DPR)",0,"Anual","Producto","Número","N/D",0,0,1,0,1,"DPR-Dirección de Política y Regulación",false,null,null,"PND",0,"PES","Estructural","XII. Pacto por la equidad de oportunidades para grupos étnicos: Indígenas, Negros, Afrocolombianos, Raizales, Palenqueros y Rrom","B. Capítulo de grupos indígenas","Objetivo 7. Disminuir la brecha entre la población étnica y no\nétnica, en términos de acceso a los servicios de agua y saneamiento\nbásico de alta calidad, a través de la implementación de esquemas\ndiferenciales y de soluciones acordes con las características\nlocales y sociales de la población étnica.","ODS 11. Ciudades y comunidades sostenibles","SI"]
["Estudio concertado sobre potabilidad y acceso al agua según las particularidades del territorio y la cosmovisión del pueblo indígena que lo requieran","Agua Potable y Saneamiento Básico","Mejorar la cobertura, calidad y continuidad de los servicios de Agua Potable y Saneamiento Básico","Aumentar coberturas de acueducto y alcantarillado en zonas rurales y zonas urbanas con grandes brechas","XII. Pacto por la equidad de oportunidades para grupos étnicos: Indígenas, Negros, Afrocolombianos, Raizales, Palenqueros y Rrom","B. Capítulo de grupos indígenas","Objetivo 7. Disminuir la brecha entre la población étnica y no\nétnica, en términos de acceso a los servicios de agua y saneamiento\nbásico de alta calidad, a través de la implementación de esquemas\ndiferenciales y de soluciones acordes con las características\nlocales y sociales de la población étnica.","ODS 11. Ciudades y comunidades sostenibles","-","Dimensión 2. Direccionamiento Estratégico y Planeación ","Gestión a la Política de Agua Potable y Saneamiento Básico","Estudio concertado sobre potabilidad y acceso al agua según las particularidades del territorio y la cosmovisión del pueblo indígena que lo requieran","Sumatoria de estudios de comunidades indígenas","Realizar un estudio sobre potabilidad y acceso al agua con base en los formularios generados de la plataforma SIASAR para comunidades indígenas","Variable 1 Estudios : corresponde a los estudios de comunidades indígenas realizados",null,"Suma","2018-12-31","Dirección de Política y Regulación (DPR)",0,"Anual","Producto","Número","N/D",0,0,0,1,1,"DPR-Dirección de Política y Regulación",false,null,null,"PND",null,null,"Transversal","XII. Pacto por la equidad de oportunidades para grupos étnicos: Indígenas, Negros, Afrocolombianos, Raizales, Palenqueros y Rrom","B. Capítulo de grupos indígenas","Objetivo 7. Disminuir la brecha entre la población étnica y no\nétnica, en términos de acceso a los servicios de agua y saneamiento\nbásico de alta calidad, a través de la implementación de esquemas\ndiferenciales y de soluciones acordes con las características\nlocales y sociales de la población étnica."]
["Estudios y propuestas de disposiciones o modificaciones normativas o de política del sector (APSB)","Agua Potable y Saneamiento Básico","Mejorar la cobertura, calidad y continuidad de los servicios de Agua Potable y Saneamiento Básico"," Fortalecer la capacidad institucional de las entidades nacionales del sector y las  territoriales en la estructuración de  proyectos y esquemas de prestación sostenibles","VIII. Pacto por la calidad y eficiencia de los servicios públicos: agua y energía para promover la competitividad y el bienestar de todos","B. Agua limpia y saneamiento básico adecuado: hacia una gestión responsable, sostenible y equitativa","Objetivo 1. Implementar estrategias para el logro de una prestación eficiente, sostenible e incluyente de los servicios de APSB con orientación regional, y una política nacional de gestión integral de residuos sólidos que articule el concepto de economía circular","ODS 6. Agua limpia y saneamiento","ODS 11. Ciudades y comunidades sostenibles","Dimensión 2. Direccionamiento Estratégico y Planeación ","Gestión a la Política de Agua Potable y Saneamiento Básico","Estudios y propuestas de disposiciones o modificaciones normativas o de política del sector (APSB)","Sumatoria de estudios e instrumentos normativos o de política del sector ","Estructurar estudios y propuestas de  disposiciones o modificaciones normativas o de política del sector (APSB), con el fin de fortalecer la capacidad institucional y territorial en la estructuración de proyectos y esquemas de prestación sostenibles, y la eficiencia y sostenibilidad de los prestadores del sector","Variable 1 Estudios e instrumentos normativos o de política del sector agua potable y saneamiento básico: corresponde a los proyectos normativos estructurados que sean enviados a la OAJ para su revisión y que obtengan VoBo de esta dependencia más los  documentos de estudio terminados con VoBo de la DDS",null,"Suma ","2018-12-31","Dirección de Política y Regulación (DPR)","NA","Trimestral","Eficiencia","Número",10,11,10,14,1,36,"DPR-Dirección de Política y Regulación",false,null,null,"Gestión",null,null,"Estructural ","VIII. Pacto por la calidad y eficiencia de los servicios públicos: agua y energía para promover la competitividad y el bienestar de todos","B. Agua limpia y saneamiento básico adecuado: hacia una gestión responsable, sostenible y equitativa","Objetivo 1. Implementar estrategias para el logro de una prestación eficiente, sostenible e incluyente de los servicios de APSB con orientación regional, y una política nacional de gestión integral de residuos sólidos que articule el concepto de economía circular"]
["Mesas territoriales implementadas en el marco del Programa Agua al Campo en Meta, Guaviare y Guajira con participación de los pueblos indígenas concernidos","Agua Potable y Saneamiento Básico","Mejorar la cobertura, calidad y continuidad de los servicios de Agua Potable y Saneamiento Básico","Aumentar coberturas de acueducto y alcantarillado en zonas rurales y zonas urbanas con grandes brechas","XII. Pacto por la equidad de oportunidades para grupos étnicos: Indígenas, Negros, Afrocolombianos, Raizales, Palenqueros y Rrom","B. Capítulo de grupos indígenas","Objetivo 7. Disminuir la brecha entre la población étnica y no\nétnica, en términos de acceso a los servicios de agua y saneamiento\nbásico de alta calidad, a través de la implementación de esquemas\ndiferenciales y de soluciones acordes con las características\nlocales y sociales de la población étnica.","ODS 11. Ciudades y comunidades sostenibles","-","Dimensión 2. Direccionamiento Estratégico y Planeación ","Gestión a la Política de Agua Potable y Saneamiento Básico","Mesas territoriales implementadas en el marco del Programa Agua al Campo en Meta, Guaviare y Guajira con participación de los pueblos indígenas concernidos","Sumatoria de mesas implementadas en el marco del Programa Agua al campo en los departamentos de Meta, Guaviare y Guajira","Medir la gestión realizada para la Implementación de mesas territoriales por departamento","Variable 1 Mesas Realizadas: corresponde a las mesas implementadas en el marco del Programa Agua al campo en los departamentos de Meta, Guaviare y Guajira",null,"Suma","2018-12-31","Dirección de Política y Regulación (DPR)",0,"Anual","Gestión ","Número","N/D",0,1,1,1,3,"DPR-Dirección de Política y Regulación",false,null,null,"PND",null,null,"Estructural ","XII. Pacto por la equidad de oportunidades para grupos étnicos: Indígenas, Negros, Afrocolombianos, Raizales, Palenqueros y Rrom","B. Capítulo de grupos indígenas","Objetivo 7. Disminuir la brecha entre la población étnica y no\nétnica, en términos de acceso a los servicios de agua y saneamiento\nbásico de alta calidad, a través de la implementación de esquemas\ndiferenciales y de soluciones acordes con las características\nlocales y sociales de la población étnica."]
["Municipios con esquemas de aprovechamiento en operación","Agua Potable y Saneamiento Básico","Mejorar la cobertura, calidad y continuidad de los servicios de Agua Potable y Saneamiento Básico","Incrementar el tratamiento y aprovechamiento de residuos sólidos y aguas residuales domésticas urbanas","VIII. Pacto por la calidad y eficiencia de los servicios públicos: agua y energía para promover la competitividad y el bienestar de todos","B. Agua limpia y saneamiento básico adecuado: hacia una gestión responsable, sostenible y equitativa","Objetivo 5. Adoptar medidas para proteger las fuentes de agua y garantizar su sostenibilidad en el tiempo, con un enfoque de Economía Circular","ODS 11. Ciudades y comunidades sostenibles","ODS 6. Agua limpia y saneamiento","Dimensión 2. Direccionamiento Estratégico y Planeación ","Gestión a la Política de Agua Potable y Saneamiento Básico","Municipios con esquemas de aprovechamiento en operación","Número de municipios con esquema de aprovechamiento en el territorio colombiano","Incrementar el número de municipios con esquemas de aprovechamiento en operación","Variable 1 Número de municipios con esquema de aprovechamiento en el territorio colombiano: Corresponde al número de municipios que cuentan con, al menos, un operador de la actividad de aprovechamiento en el marco del servicio público de aseo, de acuerdo con lo definido en el Decreto 596 de 2016",null,"Creciente","2017-12-31","Superintendencia de Servicios Públicos Domiciliarios (SSPD)",30,"Anual","Producto","Número",53,59,180,185,190,190,"DPR-Dirección de Política y Regulación",false,null,null,"PND",null,null,"Transversal","VIII. Pacto por la calidad y eficiencia de los servicios públicos: agua y energía para promover la competitividad y el bienestar de todos","B. Agua limpia y saneamiento básico adecuado: hacia una gestión responsable, sostenible y equitativa","Objetivo 5. Adoptar medidas para proteger las fuentes de agua y garantizar su sostenibilidad en el tiempo, con un enfoque de Economía Circular"]
["Número de asistencias técnicas realizadas a los grupos de valor en el marco de las competencias del VASB reportadas en el sistema de información","Agua Potable y Saneamiento Básico","Mejorar la cobertura, calidad y continuidad de los servicios de Agua Potable y Saneamiento Básico"," Fortalecer la capacidad institucional de las entidades nacionales del sector y las  territoriales en la estructuración de  proyectos y esquemas de prestación sostenibles","VIII. Pacto por la calidad y eficiencia de los servicios públicos: agua y energía para promover la competitividad y el bienestar de todos","B. Agua limpia y saneamiento básico adecuado: hacia una gestión responsable, sostenible y equitativa","Objetivo 1. Implementar estrategias para el logro de una prestación eficiente, sostenible e incluyente de los servicios de APSB con orientación regional, y una política nacional de gestión integral de residuos sólidos que articule el concepto de economía circular","ODS 6. Agua limpia y saneamiento","ODS 11. Ciudades y comunidades sostenibles","Dimensión 2. Direccionamiento Estratégico y Planeación ","Gestión a la Política de Agua Potable y Saneamiento Básico","Número de asistencias técnicas realizadas a los grupos de valor en el marco de las competencias del VASB reportadas en el sistema de información","Número de asistencias técnicas realizadas a los grupos de valor en el marco de las competencias del VASB reportadas en el sistema de información.","Medir el número de personas con acceso a soluciones adecuadas de agua potable en la región Amazonía","Variable 1 Nuevas personas con acceso a soluciones adecuadas de agua potable: mide el número de personas atendidas del total de población, que tienen acceso a métodos de abastecimiento de agua adecuados en el tiempo t, como contribución a la mejora en el acceso a agua potable de la población de la Amazonía. La población con acceso a métodos de abastecimiento de agua adecuados es aquella que se abastece del líquido, usando cualquiera de los siguientes métodos: Para cabecera: acueducto; Para resto: acueducto y soluciones alternativas (otra fuente por tubería, pozo con bomba y pila pública)",null,"Suma","2018-12-31","Gran Encuenta Integrada de Hogares (GEIH) del Departamento Administrativo Nacional de Estadística (DANE) y el Departamento Nacional de Planeación (DNP)",180,"Trimestral ","Eficiencia","Número",0,0,320,730,150,1200,"DPR-Dirección de Política y Regulación",false,null,null,"Gestión",null,null,"Estructural ","VIII. Pacto por la calidad y eficiencia de los servicios públicos: agua y energía para promover la competitividad y el bienestar de todos","B. Agua limpia y saneamiento básico adecuado: hacia una gestión responsable, sostenible y equitativa","Objetivo 1. Implementar estrategias para el logro de una prestación eficiente, sostenible e incluyente de los servicios de APSB con orientación regional, y una política nacional de gestión integral de residuos sólidos que articule el concepto de economía circular"]
["Personas beneficiadas con proyectos que mejoran provisión, calidad y/o continuidad de los servicios de acueducto y alcantarillado, en el marco del programa Guajira Azul","Agua Potable y Saneamiento Básico","Mejorar la cobertura, calidad y continuidad de los servicios de Agua Potable y Saneamiento Básico","Mejorar la provisión, calidad y/o continuidad de los servicios de acueducto y alcantarillado","VIII. Pacto por la calidad y eficiencia de los servicios públicos: agua y energía para promover la competitividad y el bienestar de todos","B. Agua limpia y saneamiento básico adecuado: hacia una gestión responsable, sostenible y equitativa","Objetivo 1. Implementar estrategias para el logro de una prestación eficiente, sostenible e incluyente de los servicios de APSB con orientación regional, y una política nacional de gestión integral de residuos sólidos que articule el concepto de economía circular","ODS 6. Agua limpia y saneamiento","ODS 11. Ciudades y comunidades sostenibles","Dimensión 2. Direccionamiento Estratégico y Planeación ","Gestión a la Política de Agua Potable y Saneamiento Básico","Personas beneficiadas con proyectos que mejoran provisión, calidad y/o continuidad de los servicios de acueducto y alcantarillado, en el marco del programa Guajira Azul","Sumatoria de personas beneficiadas con proyectos que mejoran provisión, calidad y/o continuidad de acueducto y alcantarillado en la vigencia, en el marco del programa Guajira Azul ","Medir el número de personas con acceso a soluciones adecuadas de agua potable en la región Caribe","Variable 1 Nuevas personas con acceso a soluciones adecuadas de agua potable: mide el número de personas atendidas del total de población, que tienen acceso a métodos de abastecimiento de agua adecuados en el tiempo t, como contribución a la mejora en el acceso a agua potable de la población de la región Caribe. La población con acceso a métodos de abastecimiento de agua adecuados es aquella que se abastece del líquido, usando cualquiera de los siguientes métodos: Para cabecera: acueducto; Para resto: acueducto y soluciones alternativas (otra fuente por tubería, pozo con bomba y pila pública)",null,"Suma","2018-12-31","Gran Encuenta Integrada de Hogares (GEIH) del Departamento Administrativo Nacional de Estadística (DANE) y el Departamento Nacional de Planeación (DNP)",180,"Semestral ","Resultado","Número",0,248758,500000,540000,620000,620000,"DPR-Dirección de Política y Regulación",false,null,null,"Gestión",null,null,"Transversal","VIII. Pacto por la calidad y eficiencia de los servicios públicos: agua y energía para promover la competitividad y el bienestar de todos","B. Agua limpia y saneamiento básico adecuado: hacia una gestión responsable, sostenible y equitativa","Objetivo 1. Implementar estrategias para el logro de una prestación eficiente, sostenible e incluyente de los servicios de APSB con orientación regional, y una política nacional de gestión integral de residuos sólidos que articule el concepto de economía circular"]
["Porcentaje de aguas residuales urbanas tratadas","Agua Potable y Saneamiento Básico","Mejorar la cobertura, calidad y continuidad de los servicios de Agua Potable y Saneamiento Básico","Incrementar el tratamiento y aprovechamiento de residuos sólidos y aguas residuales domésticas urbanas","VIII. Pacto por la calidad y eficiencia de los servicios públicos: agua y energía para promover la competitividad y el bienestar de todos","B. Agua limpia y saneamiento básico adecuado: hacia una gestión responsable, sostenible y equitativa","Objetivo 5. Adoptar medidas para proteger las fuentes de agua y garantizar su sostenibilidad en el tiempo, con un enfoque de Economía Circular","ODS 6. Agua limpia y saneamiento","ODS 12. Producción y consumo responsables","Dimensión 2. Direccionamiento Estratégico y Planeación ","Gestión a la Política de Agua Potable y Saneamiento Básico","Porcentaje de aguas residuales urbanas tratadas","Porcentaje de aguas residuales urbanas tratadas","Medir el número de personas con acceso a soluciones adecuadas de agua potable en la región Pacífico","Variable 1 Nuevas personas con acceso a soluciones adecuadas de agua potable: mide el número de personas atendidas del total de población, que tienen acceso a métodos de abastecimiento de agua adecuados en el tiempo t, como contribución a la mejora en el acceso a agua potable de la población de la región Pacífico. La población con acceso a métodos de abastecimiento de agua adecuados es aquella que se abastece del líquido, usando cualquiera de los siguientes métodos: Para cabecera: acueducto; Para resto: acueducto y soluciones alternativas (otra fuente por tubería, pozo con bomba y pila pública)",null,"Suma","2018-12-31","Gran Encuenta Integrada de Hogares (GEIH) del Departamento Administrativo Nacional de Estadística (DANE) y el Departamento Nacional de Planeación (DNP)",180,"Anual ","Resultado","Porcentaje",42.6,48,48,48,54.300000000000004,54.300000000000004,"DPR-Dirección de Política y Regulación",false,null,null,"PND",null,null,"Transversal","VIII. Pacto por la calidad y eficiencia de los servicios públicos: agua y energía para promover la competitividad y el bienestar de todos","B. Agua limpia y saneamiento básico adecuado: hacia una gestión responsable, sostenible y equitativa","Objetivo 5. Adoptar medidas para proteger las fuentes de agua y garantizar su sostenibilidad en el tiempo, con un enfoque de Economía Circular"]
["Porcentaje de asistencias técnicas a prestadores que atienden territorios indígenas en municipios priorizados","Agua Potable y Saneamiento Básico","Mejorar la cobertura, calidad y continuidad de los servicios de Agua Potable y Saneamiento Básico","Aumentar coberturas de acueducto y alcantarillado en zonas rurales y zonas urbanas con grandes brechas","XII. Pacto por la equidad de oportunidades para grupos étnicos: Indígenas, Negros, Afrocolombianos, Raizales, Palenqueros y Rrom","B. Capítulo de grupos indígenas","Objetivo 7. Disminuir la brecha entre la población étnica y no\nétnica, en términos de acceso a los servicios de agua y saneamiento\nbásico de alta calidad, a través de la implementación de esquemas\ndiferenciales y de soluciones acordes con las características\nlocales y sociales de la población étnica.","ODS 11. Ciudades y comunidades sostenibles","-","Dimensión 2. Direccionamiento Estratégico y Planeación ","Gestión a la Política de Agua Potable y Saneamiento Básico","Porcentaje de asistencias técnicas a prestadores que atienden territorios indígenas en municipios priorizados","(Número de asistencias realizadas a prestadores de comunidades indígenas/ Número de prestadores indígenas sin planes de emergencia y contingencia priorizados)*100","Medir el número de personas con acceso a soluciones adecuadas de agua potable en la región Seaflower","Variable 1 Nuevas personas con acceso a soluciones adecuadas de agua potable: mide el número de personas atendidas del total de población, que tienen acceso a métodos de abastecimiento de agua adecuados en el tiempo t, como contribución a la mejora en el acceso a agua potable de la población de Seaflower. La población con acceso a métodos de abastecimiento de agua adecuados es aquella que se abastece del líquido, usando cualquiera de los siguientes métodos: Para cabecera: acueducto; Para resto: acueducto y soluciones alternativas (otra fuente por tubería, pozo con bomba y pila pública)",null,"Suma","2018-12-31","Gran Encuenta Integrada de Hogares (GEIH) del Departamento Administrativo Nacional de Estadística (DANE) y el Departamento Nacional de Planeación (DNP)",180,"Anual","Producto","Porcentaje","N/D",0,0,50,50,100,"DPR-Dirección de Política y Regulación",false,null,null,"PND",null,null,"Transversal","XII. Pacto por la equidad de oportunidades para grupos étnicos: Indígenas, Negros, Afrocolombianos, Raizales, Palenqueros y Rrom","B. Capítulo de grupos indígenas","Objetivo 7. Disminuir la brecha entre la población étnica y no\nétnica, en términos de acceso a los servicios de agua y saneamiento\nbásico de alta calidad, a través de la implementación de esquemas\ndiferenciales y de soluciones acordes con las características\nlocales y sociales de la población étnica."]
["Porcentaje de asistencias técnicas brindadas a los departamentos en el marco de los Planes Departamentales de Agua en proyectos de agua y saneamiento básico concertada con las comunidades negras, afro, raizales y Palenqueras","Agua Potable y Saneamiento Básico","Mejorar la cobertura, calidad y continuidad de los servicios de Agua Potable y Saneamiento Básico","Aumentar coberturas de acueducto y alcantarillado en zonas rurales y zonas urbanas con grandes brechas","XII. Pacto por la equidad de oportunidades para grupos étnicos: Indígenas, Negros, Afrocolombianos, Raizales, Palenqueros y Rrom","D. Capítulo negros, afrodescendientes, raizales y Palenqueros","Objetivo 7. Disminuir la brecha entre la población étnica y no\nétnica, en términos de acceso a los servicios de agua y saneamiento\nbásico de alta calidad, a través de la implementación de esquemas\ndiferenciales y de soluciones acordes con las características\nlocales y sociales de la población étnica.","ODS 11. Ciudades y comunidades sostenibles","-","Dimensión 2. Direccionamiento Estratégico y Planeación ","Gestión a la Política de Agua Potable y Saneamiento Básico","Porcentaje de asistencias técnicas brindadas a los departamentos en el marco de los Planes Departamentales de Agua en proyectos de agua y saneamiento básico concertada con las comunidades negras, afro, raizales y Palenqueras","(Número de asistencias técnicas atendidas /Número de asistencias técnicas solicitadas)*100","Medir el número de nuevas personas beneficiadas con soluciones adecuadas para el manejo de aguas residuales en la región Amazonía","Variable 1 Nuevas personas con acceso a soluciones adecuadas para el manejo de aguas residuales: mide el número de personas atendidas del total de población, que tienen acceso a métodos de saneamiento adecuados en el tiempo t, como contribución a la mejora en el saneamiento básico de la región Amazonía. La población con acceso a métodos de saneamiento adecuados es aquella que cuenta con:  Para cabecera: alcantarillado Para resto: alcantarillado y soluciones alternativas (inodoro conectado a pozo séptico y letrina)",null,"Suma","2018-12-31","Gran Encuenta Integrada de Hogares (GEIH) del Departamento Administrativo Nacional de Estadística (DANE) y el Departamento Nacional de Planeación (DNP)",60,"Anual","Producto","Porcentaje","N/D",0,33,33,34,100,"DPR-Dirección de Política y Regulación",false,null,null,"PND",null,null,"Transversal","XII. Pacto por la equidad de oportunidades para grupos étnicos: Indígenas, Negros, Afrocolombianos, Raizales, Palenqueros y Rrom","D. Capítulo negros, afrodescendientes, raizales y Palenqueros","Objetivo 7. Disminuir la brecha entre la población étnica y no\nétnica, en términos de acceso a los servicios de agua y saneamiento\nbásico de alta calidad, a través de la implementación de esquemas\ndiferenciales y de soluciones acordes con las características\nlocales y sociales de la población étnica."]
["Porcentaje de comunidades priorizados indígenas de los pueblos Wayuu, Jiw y Nukak con acceso a agua potable y saneamiento básico","Agua Potable y Saneamiento Básico","Mejorar la cobertura, calidad y continuidad de los servicios de Agua Potable y Saneamiento Básico","Aumentar coberturas de acueducto y alcantarillado en zonas rurales y zonas urbanas con grandes brechas","XII. Pacto por la equidad de oportunidades para grupos étnicos: Indígenas, Negros, Afrocolombianos, Raizales, Palenqueros y Rrom","B. Capítulo de grupos indígenas","Objetivo 7. Disminuir la brecha entre la población étnica y no\nétnica, en términos de acceso a los servicios de agua y saneamiento\nbásico de alta calidad, a través de la implementación de esquemas\ndiferenciales y de soluciones acordes con las características\nlocales y sociales de la población étnica.","ODS 11. Ciudades y comunidades sostenibles","-","Dimensión 2. Direccionamiento Estratégico y Planeación ","Gestión a la Política de Agua Potable y Saneamiento Básico","Porcentaje de comunidades priorizados indígenas de los pueblos Wayuu, Jiw y Nukak con acceso a agua potable y saneamiento básico","(Comunidades priorizadas de los pueblos Wayuu, Jiw y Nukak / Comunidades con diagnóstico SIASAR de los pueblos Wayuu, Jiw y Nukak)*100","Medir el número de nuevas personas beneficiadas con soluciones adecuadas para el manejo de aguas residuales en la región Pacífico","Variable 1 Nuevas personas con acceso a soluciones adecuadas para el manejo de aguas residuales: mide el número de personas atendidas del total de población, que tienen acceso a métodos de saneamiento adecuados en el tiempo t, como contribución a la mejora en el saneamiento básico de la región Pacífico. La población con acceso a métodos de saneamiento adecuados es aquella que cuenta con: Para cabecera: alcantarillado Para resto: alcantarillado y soluciones alternativas (inodoro conectado a pozo séptico y letrina)",null,"Suma","2018-12-31","Gran Encuenta Integrada de Hogares (GEIH) del Departamento Administrativo Nacional de Estadística (DANE) y el Departamento Nacional de Planeación (DNP)",180,"Anual","Producto","Porcentaje","N/D",0,33,33,34,100,"DPR-Dirección de Política y Regulación",false,null,null,"PND",null,null,"Transversal","XII. Pacto por la equidad de oportunidades para grupos étnicos: Indígenas, Negros, Afrocolombianos, Raizales, Palenqueros y Rrom","B. Capítulo de grupos indígenas","Objetivo 7. Disminuir la brecha entre la población étnica y no\nétnica, en términos de acceso a los servicios de agua y saneamiento\nbásico de alta calidad, a través de la implementación de esquemas\ndiferenciales y de soluciones acordes con las características\nlocales y sociales de la población étnica."]
["Porcentaje de hogares con servicio de recolección de basuras ","Agua Potable y Saneamiento Básico","Mejorar la cobertura, calidad y continuidad de los servicios de Agua Potable y Saneamiento Básico","Incrementar el tratamiento y aprovechamiento de residuos sólidos y aguas residuales domésticas urbanas","VIII. Pacto por la calidad y eficiencia de los servicios públicos: agua y energía para promover la competitividad y el bienestar de todos","B. Agua limpia y saneamiento básico adecuado: hacia una gestión responsable, sostenible y equitativa","Objetivo 1. Implementar estrategias para el logro de una prestación eficiente, sostenible e incluyente de los servicios de APSB con orientación regional, y una política nacional de gestión integral de residuos sólidos que articule el concepto de economía circular","ODS 6. Agua limpia y saneamiento","-","Dimensión 2. Direccionamiento Estratégico y Planeación ","Gestión a la Política de Agua Potable y Saneamiento Básico","Porcentaje de hogares con servicio de recolección de basuras ","(Hogares que cuentan con servicio de recolección de basuras/Total de hogares)*100 \n","Medir el total de asistencias técnicas brindadas por el VASB en el marco de sus competencias a los grupos de valor del sector","Variable 1 Asistencias técnicas realizadas:  corresponde al número de asistencias técnicas brindadas a los grupos de valor en el marco de las competencias del VASB  reportadas por el sistema de información",null,"Suma","2019-12-31","Dirección de Política y Regulación (DPR)","NA","Anual","Resultado","Porcentaje",81.7,82.38,83.06,83.74,84.42,84.42,"DPR-Dirección de Política y Regulación",false,null,null,"PND",null,null,"Transversal","VIII. Pacto por la calidad y eficiencia de los servicios públicos: agua y energía para promover la competitividad y el bienestar de todos","B. Agua limpia y saneamiento básico adecuado: hacia una gestión responsable, sostenible y equitativa","Objetivo 1. Implementar estrategias para el logro de una prestación eficiente, sostenible e incluyente de los servicios de APSB con orientación regional, y una política nacional de gestión integral de residuos sólidos que articule el concepto de economía circular"]
["Porcentaje de hogares con servicio de recolección de basuras en zona rural ","Agua Potable y Saneamiento Básico","Mejorar la cobertura, calidad y continuidad de los servicios de Agua Potable y Saneamiento Básico","Incrementar el tratamiento y aprovechamiento de residuos sólidos y aguas residuales domésticas urbanas","VIII. Pacto por la calidad y eficiencia de los servicios públicos: agua y energía para promover la competitividad y el bienestar de todos","B. Agua limpia y saneamiento básico adecuado: hacia una gestión responsable, sostenible y equitativa","Objetivo 1. Implementar estrategias para el logro de una prestación eficiente, sostenible e incluyente de los servicios de APSB con orientación regional, y una política nacional de gestión integral de residuos sólidos que articule el concepto de economía circular","ODS 6. Agua limpia y saneamiento","-","Dimensión 2. Direccionamiento Estratégico y Planeación ","Gestión a la Política de Agua Potable y Saneamiento Básico","Porcentaje de hogares con servicio de recolección de basuras en zona rural ","(Hogares rurales que cuentan con servicio de recolección de basuras/Total de hogares rurales)*100","Mejorar la provisión, calidad y/o continuidad de los servicios de acueducto y alcantarillado en el marco del programa Guajira Azul","Variable 1 Personas beneficiadas: corresponde al número de personas beneficiadas con proyectos que mejoran provisión, calidad y/o continuidad de acueducto y alcantarillado en la vigencia, en el marco del programa Guajira Azul de acuerdo a los proyectos terminados",null,"Creciente","2018-12-31","Dirección de Política y Regulación (DPR)",0,"Anual","Resultado","Porcentaje",23.9,25.7,27.5,29.3,31.1,31.1,"DPR-Dirección de Política y Regulación",false,null,null,"PND",null,null,"Transversal","VIII. Pacto por la calidad y eficiencia de los servicios públicos: agua y energía para promover la competitividad y el bienestar de todos","B. Agua limpia y saneamiento básico adecuado: hacia una gestión responsable, sostenible y equitativa","Objetivo 1. Implementar estrategias para el logro de una prestación eficiente, sostenible e incluyente de los servicios de APSB con orientación regional, y una política nacional de gestión integral de residuos sólidos que articule el concepto de economía circular"]
["Porcentaje de hogares con servicio de recolección de basuras en zona urbana","Agua Potable y Saneamiento Básico","Mejorar la cobertura, calidad y continuidad de los servicios de Agua Potable y Saneamiento Básico","Incrementar el tratamiento y aprovechamiento de residuos sólidos y aguas residuales domésticas urbanas","VIII. Pacto por la calidad y eficiencia de los servicios públicos: agua y energía para promover la competitividad y el bienestar de todos","B. Agua limpia y saneamiento básico adecuado: hacia una gestión responsable, sostenible y equitativa","Objetivo 1. Implementar estrategias para el logro de una prestación eficiente, sostenible e incluyente de los servicios de APSB con orientación regional, y una política nacional de gestión integral de residuos sólidos que articule el concepto de economía circular","ODS 6. Agua limpia y saneamiento","-","Dimensión 2. Direccionamiento Estratégico y Planeación ","Gestión a la Política de Agua Potable y Saneamiento Básico","Porcentaje de hogares con servicio de recolección de basuras en zona urbana","(Hogares urbanos que cuentan con servicio de recolección de basuras/Total de hogares urbanos)*100","Mide el número de personas con acceso a soluciones adecuadas de agua potable","Variable 1 personas con acceso a soluciones adecuadas de agua potable: mide el número de personas atendidas del total de población, que tienen acceso a métodos de abastecimiento de agua adecuados en el tiempo t, como contribución a la mejora en el acceso a agua potable de la población colombiana. La población con acceso a métodos de abastecimiento de agua adecuados es aquella que se abastece del líquido, usando cualquiera de los siguientes métodos: Para cabecera: acueducto; Para resto: acueducto y soluciones alternativas (otra fuente por tubería, pozo con bomba y pila pública)",null,"Creciente","2018-12-31","Gran Encuenta Integrada de Hogares (GEIH) del Departamento Administrativo Nacional de Estadística (DANE) y el Departamento Nacional de Planeación (DNP)",180,"Anual","Resultado","Porcentaje",98.6,98.81,98.91,99.02,99.9,99.9,"DPR-Dirección de Política y Regulación",false,null,null,"PND",30,null,"Estructural","VIII. Pacto por la calidad y eficiencia de los servicios públicos: agua y energía para promover la competitividad y el bienestar de todos","B. Agua limpia y saneamiento básico adecuado: hacia una gestión responsable, sostenible y equitativa","Objetivo 1. Implementar estrategias para el logro de una prestación eficiente, sostenible e incluyente de los servicios de APSB con orientación regional, y una política nacional de gestión integral de residuos sólidos que articule el concepto de economía circular","ODS 5. Igualdad de género","NO"]
["Porcentaje de hogares rurales con acceso a soluciones adecuadas de agua potable en municipios PDET (PAZ)","Agua Potable y Saneamiento Básico","Mejorar la cobertura, calidad y continuidad de los servicios de Agua Potable y Saneamiento Básico","Aumentar coberturas de acueducto y alcantarillado en zonas rurales y zonas urbanas con grandes brechas","XI. Pacto por la Construcción de Paz: Cultura de la legalidad, convivencia, estabilización y víctimas"," A. Acciones efectivas para la política de estabilización: intervención coordinada en zonas estratégicas con seguridad, justicia y equidad","Objetivo 1. Estabilizar los territorios rurales, principalmente en los 170 municipios PDET","ODS 16. Paz, justicia e instituciones sólidas","ODS 6. Agua limpia y saneamiento","Dimensión 3. Gestión con Valores para Resultados","Gestión a la Política de Agua Potable y Saneamiento Básico","Porcentaje de hogares rurales con acceso a soluciones adecuadas de agua potable en municipios PDET (PAZ)","Porcentaje de hogares rurales con acceso a soluciones adecuadas de agua potable en municipios PDET","Mide el número de personas con acceso a soluciones adecuadas de agua potable en zona rural","Variable 1 personas con acceso a soluciones adecuadas de agua potable: mide el número de personas atendidas del total de población, que tienen acceso a métodos de abastecimiento de agua adecuados en zona rural en el tiempo t, como contribución a la mejora en el acceso a gua potable de la población colombiana. La población con acceso a métodos de abastecimiento de agua adecuados es aquella que se abastece del líquido, usando cualquiera de los siguientes métodos: Para cabecera: acueducto; Para resto: acueducto y soluciones alternativas (otra fuente por tubería, pozo con bomba y pila pública)",null,"Creciente","2018-12-31","Gran Encuenta Integrada de Hogares (GEIH) del Departamento Administrativo Nacional de Estadística (DANE) y el Departamento Nacional de Planeación (DNP)",180,"Anual","Resultado","Porcentaje",28,29,31,34,40,40,"DPR-Dirección de Política y Regulación",false,null,null,"PND",30,"PES","Estructural","XI. Pacto por la Construcción de Paz: Cultura de la legalidad, convivencia, estabilización y víctimas"," A. Acciones efectivas para la política de estabilización: intervención coordinada en zonas estratégicas con seguridad, justicia y equidad","Objetivo 1. Estabilizar los territorios rurales, principalmente en los 170 municipios PDET","ODS 11. Ciudades y comunidades sostenibles","NO"]
["Porcentaje de hogares rurales con acceso a soluciones adecuadas para el manejo de aguas residuales en municipios PDET (PAZ)","Agua Potable y Saneamiento Básico","Mejorar la cobertura, calidad y continuidad de los servicios de Agua Potable y Saneamiento Básico","Aumentar coberturas de acueducto y alcantarillado en zonas rurales y zonas urbanas con grandes brechas","XI. Pacto por la Construcción de Paz: Cultura de la legalidad, convivencia, estabilización y víctimas"," A. Acciones efectivas para la política de estabilización: intervención coordinada en zonas estratégicas con seguridad, justicia y equidad","Objetivo 1. Estabilizar los territorios rurales, principalmente en los 170 municipios PDET","ODS 16. Paz, justicia e instituciones sólidas","ODS 6. Agua limpia y saneamiento","Dimensión 3. Gestión con Valores para Resultados","Gestión a la Política de Agua Potable y Saneamiento Básico","Porcentaje de hogares rurales con acceso a soluciones adecuadas para el manejo de aguas residuales en municipios PDET (PAZ)","Porcentaje de hogares rurales con acceso a soluciones adecuadas para el manejo de aguas residuales en municipios PDET ","Mide el número de personas con acceso a soluciones adecuadas de agua potable en zona urbana","Variable 1 personas con acceso a soluciones adecuadas de agua potable: mide el número de personas atendidas del total de población, que tienen acceso a métodos de abastecimiento de agua adecuados en zonas urbanas en el tiempo t, como contribución a la mejora en el acceso a gua potable de la población colombiana. La población con acceso a métodos de abastecimiento de agua adecuados es aquella que se abastece del líquido, usando cualquiera de los siguientes métodos: Para cabecera: acueducto; Para resto: acueducto y soluciones alternativas (otra fuente por tubería, pozo con bomba y pila pública)",null,"Creciente","2018-12-31","Gran Encuenta Integrada de Hogares (GEIH) del Departamento Administrativo Nacional de Estadística (DANE) y el Departamento Nacional de Planeación (DNP)",180,"Anual","Resultado","Porcentaje",10,11,13,16,22,22,"DPR-Dirección de Política y Regulación",false,null,null,"PND",30,"PES","Estructural","XI. Pacto por la Construcción de Paz: Cultura de la legalidad, convivencia, estabilización y víctimas"," A. Acciones efectivas para la política de estabilización: intervención coordinada en zonas estratégicas con seguridad, justicia y equidad","Objetivo 1. Estabilizar los territorios rurales, principalmente en los 170 municipios PDET","ODS 11. Ciudades y comunidades sostenibles","SI"]
["Porcentaje de Municipios con riesgo alto identificados por el Grupo SGP","Agua Potable y Saneamiento Básico","Mejorar la cobertura, calidad y continuidad de los servicios de Agua Potable y Saneamiento Básico"," Fortalecer la capacidad institucional de las entidades nacionales del sector y las  territoriales en la estructuración de  proyectos y esquemas de prestación sostenibles","VIII. Pacto por la calidad y eficiencia de los servicios públicos: agua y energía para promover la competitividad y el bienestar de todos","B. Agua limpia y saneamiento básico adecuado: hacia una gestión responsable, sostenible y equitativa","Objetivo 1. Implementar estrategias para el logro de una prestación eficiente, sostenible e incluyente de los servicios de APSB con orientación regional, y una política nacional de gestión integral de residuos sólidos que articule el concepto de economía circular","ODS 6. Agua limpia y saneamiento","ODS 11. Ciudades y comunidades sostenibles","Dimensión 2. Direccionamiento Estratégico y Planeación ","Gestión a la Política de Agua Potable y Saneamiento Básico","Porcentaje de Municipios con riesgo alto identificados por el Grupo SGP","(Número de municipios con riesgo alto/Total municipios)*100","Medir el número de personas con acceso a soluciones adecuadas para el manejo de aguas residuales ","Variable 1 Personas con acceso a soluciones adecuadas para el manejo de aguas residuales: mide el número de personas atendidas del total de población, que tienen acceso a métodos de saneamiento adecuados en el tiempo t, como contribución a la mejora en el saneamiento básico de la población colombiana. La población con acceso a métodos de saneamiento adecuados es aquella que cuenta con:  Para cabecera: alcantarillado Para resto: alcantarillado y soluciones alternativas (inodoro conectado a pozo séptico y letrina).",null,"Creciente","2018-12-31","Gran Encuenta Integrada de Hogares (GEIH) del Departamento Administrativo Nacional de Estadística (DANE) y el Departamento Nacional de Planeación (DNP)",180,"Anual ","Resultado","Porcentaje",40.4,15,30,20,10,10,"DPR-Dirección de Política y Regulación",false,null,null,"Gestión",30,"PES","Estructural","VIII. Pacto por la calidad y eficiencia de los servicios públicos: agua y energía para promover la competitividad y el bienestar de todos","B. Agua limpia y saneamiento básico adecuado: hacia una gestión responsable, sostenible y equitativa","Objetivo 1. Implementar estrategias para el logro de una prestación eficiente, sostenible e incluyente de los servicios de APSB con orientación regional, y una política nacional de gestión integral de residuos sólidos que articule el concepto de economía circular","ODS 11. Ciudades y comunidades sostenibles","NO"]
["Porcentaje de municipios que tratan adecuadamente los residuos sólidos ","Agua Potable y Saneamiento Básico","Mejorar la cobertura, calidad y continuidad de los servicios de Agua Potable y Saneamiento Básico","Incrementar el tratamiento y aprovechamiento de residuos sólidos y aguas residuales domésticas urbanas","VIII. Pacto por la calidad y eficiencia de los servicios públicos: agua y energía para promover la competitividad y el bienestar de todos","B. Agua limpia y saneamiento básico adecuado: hacia una gestión responsable, sostenible y equitativa","Objetivo 1. Implementar estrategias para el logro de una prestación eficiente, sostenible e incluyente de los servicios de APSB con orientación regional, y una política nacional de gestión integral de residuos sólidos que articule el concepto de economía circular","ODS 11. Ciudades y comunidades sostenibles","ODS 6. Agua limpia y saneamiento","Dimensión 2. Direccionamiento Estratégico y Planeación ","Gestión a la Política de Agua Potable y Saneamiento Básico","Porcentaje de municipios que tratan adecuadamente los residuos sólidos ","(Total municipios que tratan adecuadamente los residuos sólidos en la vigencia/1102)*100                                                                             ","Medir el número de personas con acceso a soluciones adecuadas para el manejo de aguas residuales en zona rural","Variable 1 Personas con acceso a soluciones adecuadas para el manejo de aguas residuales: mide el número de personas atendidas del total de población, que tienen acceso a métodos de saneamiento adecuados en el tiempo t, como contribución a la mejora en el saneamiento básico de la población colombiana en zona rural. La población con acceso a métodos de saneamiento adecuados es aquella que cuenta con:  Para cabecera: alcantarillado Para resto: alcantarillado y soluciones alternativas (inodoro conectado a pozo séptico y letrina)",null,"Creciente","2018-12-31","Gran Encuenta Integrada de Hogares (GEIH) del Departamento Administrativo Nacional de Estadística (DANE) y el Departamento Nacional de Planeación (DNP)",180,"Anual","Resultado","Porcentaje",82.8,84.5,86.2,88.5,89.9,89.9,"DPR-Dirección de Política y Regulación",false,null,null,"PND",null,null,"Estructural","VIII. Pacto por la calidad y eficiencia de los servicios públicos: agua y energía para promover la competitividad y el bienestar de todos","B. Agua limpia y saneamiento básico adecuado: hacia una gestión responsable, sostenible y equitativa","Objetivo 1. Implementar estrategias para el logro de una prestación eficiente, sostenible e incluyente de los servicios de APSB con orientación regional, y una política nacional de gestión integral de residuos sólidos que articule el concepto de economía circular"]
["Porcentaje de reciclaje en el marco del servicio público de aseo","Agua Potable y Saneamiento Básico","Mejorar la cobertura, calidad y continuidad de los servicios de Agua Potable y Saneamiento Básico","Incrementar el tratamiento y aprovechamiento de residuos sólidos y aguas residuales domésticas urbanas","VIII. Pacto por la calidad y eficiencia de los servicios públicos: agua y energía para promover la competitividad y el bienestar de todos","B. Agua limpia y saneamiento básico adecuado: hacia una gestión responsable, sostenible y equitativa","Objetivo 5. Adoptar medidas para proteger las fuentes de agua y garantizar su sostenibilidad en el tiempo, con un enfoque de Economía Circular","ODS 12. Producción y consumo responsables","ODS 6. Agua limpia y saneamiento","Dimensión 2. Direccionamiento Estratégico y Planeación ","Gestión a la Política de Agua Potable y Saneamiento Básico","Porcentaje de reciclaje en el marco del servicio público de aseo","[(Toneladas Efectivamente Aprovechadas/ (Toneladas Dispuestas + Toneladas Efectivamente Aprovechadas)]*100                                                                              ","Medir el número de personas con acceso a soluciones adecuadas para el manejo de aguas residuales en zona urbana","Variable 1 Personas con acceso a soluciones adecuadas para el manejo de aguas residuales: mide el número de personas atendidas del total de población, que tienen acceso a métodos de saneamiento adecuados en el tiempo t, como contribución a la mejora en el saneamiento básico de la población colombiana en zona urbana. La población con acceso a métodos de saneamiento adecuados es aquella que cuenta con:  Para cabecera: alcantarillado Para resto: alcantarillado y soluciones alternativas (inodoro conectado a pozo séptico y letrina)",null,"Creciente","2018-12-31","Gran Encuenta Integrada de Hogares (GEIH) del Departamento Administrativo Nacional de Estadística (DANE) y el Departamento Nacional de Planeación (DNP)",180,"Anual","Resultado","Porcentaje",5,8,10,13,15,15,"DPR-Dirección de Política y Regulación",false,null,null,"PND",null,null,"Estructural","VIII. Pacto por la calidad y eficiencia de los servicios públicos: agua y energía para promover la competitividad y el bienestar de todos","B. Agua limpia y saneamiento básico adecuado: hacia una gestión responsable, sostenible y equitativa","Objetivo 5. Adoptar medidas para proteger las fuentes de agua y garantizar su sostenibilidad en el tiempo, con un enfoque de Economía Circular"]
["Porcentaje de reglamentación del Título V del Decreto 1953 de 2014 en el marco de la comisión de impulso liderada por el Ministerio del Interior","Agua Potable y Saneamiento Básico","Mejorar la cobertura, calidad y continuidad de los servicios de Agua Potable y Saneamiento Básico","Aumentar coberturas de acueducto y alcantarillado en zonas rurales y zonas urbanas con grandes brechas","XII. Pacto por la equidad de oportunidades para grupos étnicos: Indígenas, Negros, Afrocolombianos, Raizales, Palenqueros y Rrom","B. Capítulo de grupos indígenas","Objetivo 7. Disminuir la brecha entre la población étnica y no\nétnica, en términos de acceso a los servicios de agua y saneamiento\nbásico de alta calidad, a través de la implementación de esquemas\ndiferenciales y de soluciones acordes con las características\nlocales y sociales de la población étnica.","ODS 11. Ciudades y comunidades sostenibles","-","Dimensión 2. Direccionamiento Estratégico y Planeación ","Gestión a la Política de Agua Potable y Saneamiento Básico","Porcentaje de reglamentación del Título V del Decreto 1953 de 2014 en el marco de la comisión de impulso liderada por el Ministerio del Interior","(Avance en la construcción de la reglamentación en el marco de la Comisión de Impulso del Decreto 1953, citada por el Ministerio del Interior/ Reglamentación en el marco de la Comisión de Impulso del Decreto 1953, realizada por el Ministerio del Interior)*100","Incrementar el tratamiento y aprovechamiento de residuos sólidos y aguas residuales domésticas urbanas","Variable 1 Porcentaje de aguas residuales urbanas tratadas: permite evaluar el estado del tratamiento de las aguas residuales urbanas en el país, y corresponde a la relación entre el caudal medio de tratamiento en cabeceras municipales y el caudal medio vertido estimado de aguas residuales",null,"Creciente ","2017-12-31","Superintendencia de Servicios Públicos Domiciliarios (SSPD)",365,"Anual","Producto","Porcentaje","N/D",0,33,33,34,100,"DPR-Dirección de Política y Regulación",false,null,null,"PND",null,null,"Estructural","XII. Pacto por la equidad de oportunidades para grupos étnicos: Indígenas, Negros, Afrocolombianos, Raizales, Palenqueros y Rrom","B. Capítulo de grupos indígenas","Objetivo 7. Disminuir la brecha entre la población étnica y no\nétnica, en términos de acceso a los servicios de agua y saneamiento\nbásico de alta calidad, a través de la implementación de esquemas\ndiferenciales y de soluciones acordes con las características\nlocales y sociales de la población étnica."]
["Porcentaje de residuos sólidos urbanos dispuestos adecuadamente","Agua Potable y Saneamiento Básico","Mejorar la cobertura, calidad y continuidad de los servicios de Agua Potable y Saneamiento Básico","Incrementar el tratamiento y aprovechamiento de residuos sólidos y aguas residuales domésticas urbanas","VIII. Pacto por la calidad y eficiencia de los servicios públicos: agua y energía para promover la competitividad y el bienestar de todos","B. Agua limpia y saneamiento básico adecuado: hacia una gestión responsable, sostenible y equitativa","Objetivo 1. Implementar estrategias para el logro de una prestación eficiente, sostenible e incluyente de los servicios de APSB con orientación regional, y una política nacional de gestión integral de residuos sólidos que articule el concepto de economía circular","ODS 11. Ciudades y comunidades sostenibles","ODS 6. Agua limpia y saneamiento","Dimensión 2. Direccionamiento Estratégico y Planeación ","Gestión a la Política de Agua Potable y Saneamiento Básico","Porcentaje de residuos sólidos urbanos dispuestos adecuadamente","(Toneladas dispuestas en un sitio de disposición final adecuado/Total de toneladas dispuestas)*100","Medir el proceso de asistencia técnica a prestadores priorizados","Variable 1 Asistencias Técnicas Realizadas: corresponde al número de asistencias técnicas realizadas a prestadores de comunidades indígenas","Variable 2 Prestadores indígenas: corresponde al número total de prestadores indígenas sin planes de emergencia y contingencia priorizados","Suma","2018-12-31","Dirección de Política y Regulación (DPR)",0,"Anual ","Resultado","Porcentaje",96.899999999999991,97.899999999999991,98.3,98.7,99.3,99.3,"DPR-Dirección de Política y Regulación",false,null,null,"PND",null,null,"Estructural","VIII. Pacto por la calidad y eficiencia de los servicios públicos: agua y energía para promover la competitividad y el bienestar de todos","B. Agua limpia y saneamiento básico adecuado: hacia una gestión responsable, sostenible y equitativa","Objetivo 1. Implementar estrategias para el logro de una prestación eficiente, sostenible e incluyente de los servicios de APSB con orientación regional, y una política nacional de gestión integral de residuos sólidos que articule el concepto de economía circular"]
["Porcentaje de territorios indígenas sin acceso a agua potable y/o saneamiento básico con proyectos formulados por la comunidad con apoyo técnico del equipo del viceministerio de agua y del Plan Departamental de Agua, y financiados por OCADPaz","Agua Potable y Saneamiento Básico","Mejorar la cobertura, calidad y continuidad de los servicios de Agua Potable y Saneamiento Básico","Aumentar coberturas de acueducto y alcantarillado en zonas rurales y zonas urbanas con grandes brechas","XII. Pacto por la equidad de oportunidades para grupos étnicos: Indígenas, Negros, Afrocolombianos, Raizales, Palenqueros y Rrom","B. Capítulo de grupos indígenas","Objetivo 7. Disminuir la brecha entre la población étnica y no\nétnica, en términos de acceso a los servicios de agua y saneamiento\nbásico de alta calidad, a través de la implementación de esquemas\ndiferenciales y de soluciones acordes con las características\nlocales y sociales de la población étnica.","ODS 11. Ciudades y comunidades sostenibles","-","Dimensión 2. Direccionamiento Estratégico y Planeación ","Gestión a la Política de Agua Potable y Saneamiento Básico","Porcentaje de territorios indígenas sin acceso a agua potable y/o saneamiento básico con proyectos formulados por la comunidad con apoyo técnico del equipo del viceministerio de agua y del Plan Departamental de Agua, y financiados por OCADPaz","(Número de asistencias técnicas atendidas /Número de asistencias técnicas solicitadas)*100","Medir el número de asistencias técnicas en Planes departamentales de agua con presencia de comunidades NARP que se realizarán a través del levantamiento de información de la plataforma SIASAR","Variable 1 Asistencias Técnicas Atendidas: corresponde al número de asistencias técnicas prestadas por el VASB","Variable 2 Asistencias Técnicas Solicitadas: corresponde al número de asistencias técnicas solicitadas al VASB","Creciente","2018-12-31","Dirección de Política y Regulación (DPR)",0,"Anual","Producto","Porcentaje","N/D",0,100,100,100,100,"DPR-Dirección de Política y Regulación",false,null,null,"PND",null,null,"Estructural","XII. Pacto por la equidad de oportunidades para grupos étnicos: Indígenas, Negros, Afrocolombianos, Raizales, Palenqueros y Rrom","B. Capítulo de grupos indígenas","Objetivo 7. Disminuir la brecha entre la población étnica y no\nétnica, en términos de acceso a los servicios de agua y saneamiento\nbásico de alta calidad, a través de la implementación de esquemas\ndiferenciales y de soluciones acordes con las características\nlocales y sociales de la población étnica."]
["Nuevas personas con acceso a soluciones adecuadas de agua potable (Amazonía)","Agua Potable y Saneamiento Básico","Mejorar la cobertura, calidad y continuidad de los servicios de Agua Potable y Saneamiento Básico","Aumentar coberturas de acueducto y alcantarillado en zonas rurales y zonas urbanas con grandes brechas","VIII. Pacto por la calidad y eficiencia de los servicios públicos: agua y energía para promover la competitividad y el bienestar de todos\n\nXXII. Pacto Región Amazonía: Desarrollo sostenible por una Amazonia viva","B. Agua limpia y saneamiento básico adecuado: hacia una gestión responsable, sostenible y equitativa\n\nTransversal","Objetivo 1. Implementar estrategias para el logro de una prestación eficiente, sostenible e incluyente de los servicios de APSB con orientación regional, y una política nacional de gestión integral de residuos sólidos que articule el concepto de economía circular","ODS 6. Agua limpia y saneamiento","ODS 11. Ciudades y comunidades sostenibles","Dimensión 3. Gestión con Valores para Resultados","Gestión a la Política de Agua Potable y Saneamiento Básico","Nuevas personas con acceso a soluciones adecuadas de agua potable (Amazonía)","Nuevas personas registradas como beneficiarias en los proyectos terminados con recursos PGN  en la región de la Amazonía,  de acuerdo a los registros administrativos de la Subdirección de Proyectos del VASB ","Establecer el porcentaje de comunidades Wayuu, Jiw y Nukak con diagnostico SIASAR priorizadas por Planes departamentales de agua","Variable 1 Comunidades priorizadas: corresponde a las comunidades priorizadas de los pueblos Wayuu, Jiw y Nukak","Variable 2  Comunidades con diagnóstico: corresponde a las comunidades con diagnóstico SIASAR de los pueblos Wayuu, Jiw y Nukak","Creciente","2018-12-31","Dirección de Política y Regulación (DPR)",0,"Anual","Resultado","Número",0,8393,10491,12590,10492,41966,"DPR-Dirección de Política y Regulación",false,null,null,"PND",60,"PES","Transversal","VIII. Pacto por la calidad y eficiencia de los servicios públicos: agua y energía para promover la competitividad y el bienestar de todos\n\nXXII. Pacto Región Amazonía: Desarrollo sostenible por una Amazonia viva","B. Agua limpia y saneamiento básico adecuado: hacia una gestión responsable, sostenible y equitativa\n\nTransversal","Objetivo 1. Implementar estrategias para el logro de una prestación eficiente, sostenible e incluyente de los servicios de APSB con orientación regional, y una política nacional de gestión integral de residuos sólidos que articule el concepto de economía circular","ODS 11. Ciudades y comunidades sostenibles","SI"]
["Nuevas personas con acceso a soluciones adecuadas de agua potable (Caribe)","Agua Potable y Saneamiento Básico","Mejorar la cobertura, calidad y continuidad de los servicios de Agua Potable y Saneamiento Básico","Aumentar coberturas de acueducto y alcantarillado en zonas rurales y zonas urbanas con grandes brechas","VIII. Pacto por la calidad y eficiencia de los servicios públicos: agua y energía para promover la competitividad y el bienestar de todos\n\nXVIII. Pacto Región Caribe: Una transformación para la igualdad de oportunidades y la equidad","B. Agua limpia y saneamiento básico adecuado: hacia una gestión responsable, sostenible y equitativa\n\nTransversal","Objetivo 1. Implementar estrategias para el logro de una prestación eficiente, sostenible e incluyente de los servicios de APSB con orientación regional, y una política nacional de gestión integral de residuos sólidos que articule el concepto de economía circular","ODS 6. Agua limpia y saneamiento","ODS 11. Ciudades y comunidades sostenibles","Dimensión 3. Gestión con Valores para Resultados","Gestión a la Política de Agua Potable y Saneamiento Básico","Nuevas personas con acceso a soluciones adecuadas de agua potable (Caribe)","Número de personas con acceso a soluciones adecuadas de agua potable (Caribe)","Establecer el porcentaje de hogares con servicio de recolección de basuras en el país","Variable 1 Hogares que cuentan con servicio de recolección de basuras: reporta el porcentaje total de hogares (urbanos y rurales) que cuentan con el servicio de recolección de residuos sólidos domiciliarios (para la fuente de información se refiere al término recolección de basuras). La recolección es la actividad principal del servicio público de aseo, la cobertura debe ser garantizada por los municipios o distritos a todos sus habitantes dentro de su territorio. Para la ampliación permanente de la cobertura, se requieren ejercicios de planeación que incluyan entre otros aspectos como el crecimiento de la población y la producción de residuos (Decreto 1077 de 2015, Artículo 2.3.2.2.1.7.)","Variable 2 Total de hogares: corresponde a la totalidad de hogares (rurales y urbanos) que Colombia posee","Creciente","2018-12-31","Encuesta de Calidad de Vida  del Departamento Administrativo Nacional de Estadística (DANE)",210,"Anual","Resultado","Número",0,116458,145572.25,174686.7,145572.25,582289,"DPR-Dirección de Política y Regulación",false,null,null,"PND",null,null,"Estructural ","VIII. Pacto por la calidad y eficiencia de los servicios públicos: agua y energía para promover la competitividad y el bienestar de todos\n\nXVIII. Pacto Región Caribe: Una transformación para la igualdad de oportunidades y la equidad","B. Agua limpia y saneamiento básico adecuado: hacia una gestión responsable, sostenible y equitativa\n\nTransversal","Objetivo 1. Implementar estrategias para el logro de una prestación eficiente, sostenible e incluyente de los servicios de APSB con orientación regional, y una política nacional de gestión integral de residuos sólidos que articule el concepto de economía circular"]
["Nuevas personas con acceso a soluciones adecuadas de agua potable (Pacífico)","Agua Potable y Saneamiento Básico","Mejorar la cobertura, calidad y continuidad de los servicios de Agua Potable y Saneamiento Básico","Aumentar coberturas de acueducto y alcantarillado en zonas rurales y zonas urbanas con grandes brechas","VIII. Pacto por la calidad y eficiencia de los servicios públicos: agua y energía para promover la competitividad y el bienestar de todos\n\nXVII. Pacto Región Pacífico: Diversidad para la equidad, la convivencia pacífica y el desarrollo sostenible","B. Agua limpia y saneamiento básico adecuado: hacia una gestión responsable, sostenible y equitativa\n\nTransversal","Objetivo 1. Implementar estrategias para el logro de una prestación eficiente, sostenible e incluyente de los servicios de APSB con orientación regional, y una política nacional de gestión integral de residuos sólidos que articule el concepto de economía circular","ODS 6. Agua limpia y saneamiento","ODS 11. Ciudades y comunidades sostenibles","Dimensión 3. Gestión con Valores para Resultados","Gestión a la Política de Agua Potable y Saneamiento Básico","Nuevas personas con acceso a soluciones adecuadas de agua potable (Pacífico)","Número total de personas nuevas con acceso a soluciones adecuadas de agua potable en la región Pacífico.","Establecer el porcentaje de hogares con servicio de recolección de basuras en zona rural ","Variable 1 Hogares rurales que cuentan con servicio de recolección de basuras: reporta el porcentaje de hogares rurales que cuentan con el servicio de recolección de residuos sólidos domiciliarios (para la fuente de información se refiere al término recolección de basuras). La recolección es la actividad principal del servicio público de aseo, la cobertura debe ser garantizada por los municipios o distritos a todos sus habitantes dentro de su territorio. Para la ampliación permanente de la cobertura, se requieren ejercicios de planeación que incluyan entre otros aspectos como el crecimiento de la población y la producción de residuos (Decreto 1077 de 2015, Artículo 2.3.2.2.1.7.)","Variable 2 Total de hogares: corresponde a la totalidad de hogares rurales que Colombia posee","Creciente","2018-12-31","Encuesta de Calidad de Vida  del Departamento Administrativo Nacional de Estadística (DANE)",210,"Anual","Resultado","Número",0,64431,80539,96647,80538,322155,"DPR-Dirección de Política y Regulación",false,null,null,"PND",null,null,"Estructural ","VIII. Pacto por la calidad y eficiencia de los servicios públicos: agua y energía para promover la competitividad y el bienestar de todos\n\nXVII. Pacto Región Pacífico: Diversidad para la equidad, la convivencia pacífica y el desarrollo sostenible","B. Agua limpia y saneamiento básico adecuado: hacia una gestión responsable, sostenible y equitativa\n\nTransversal","Objetivo 1. Implementar estrategias para el logro de una prestación eficiente, sostenible e incluyente de los servicios de APSB con orientación regional, y una política nacional de gestión integral de residuos sólidos que articule el concepto de economía circular"]
["Nuevas personas con acceso a soluciones adecuadas de agua potable (Seaflower)","Agua Potable y Saneamiento Básico","Mejorar la cobertura, calidad y continuidad de los servicios de Agua Potable y Saneamiento Básico","Aumentar coberturas de acueducto y alcantarillado en zonas rurales y zonas urbanas con grandes brechas","VIII. Pacto por la calidad y eficiencia de los servicios públicos: agua y energía para promover la competitividad y el bienestar de todos\n\nXIX. Pacto Seaflower Región: Por una región próspera, segura y sostenible San Andrés","B. Agua limpia y saneamiento básico adecuado: hacia una gestión responsable, sostenible y equitativa\n\nTransversal","Objetivo 1. Implementar estrategias para el logro de una prestación eficiente, sostenible e incluyente de los servicios de APSB con orientación regional, y una política nacional de gestión integral de residuos sólidos que articule el concepto de economía circular","ODS 6. Agua limpia y saneamiento","ODS 11. Ciudades y comunidades sostenibles","Dimensión 3. Gestión con Valores para Resultados","Gestión a la Política de Agua Potable y Saneamiento Básico","Nuevas personas con acceso a soluciones adecuadas de agua potable (Seaflower)","Número total de personas nuevas con acceso a soluciones adecuadas de agua potable en la región Seaflower.","Establecer el porcentaje de hogares con servicio de recolección de basuras en zona urbana","Variable 1 Hogares urbanos que cuentan con servicio de recolección de basuras: reporta el porcentaje de hogares urbanos que cuentan con el servicio de recolección de residuos sólidos domiciliarios (para la fuente de información se refiere al término recolección de basuras). La recolección es la actividad principal del servicio público de aseo, la cobertura debe ser garantizada por los municipios o distritos a todos sus habitantes dentro de su territorio. Para la ampliación permanente de la cobertura, se requieren ejercicios de planeación que incluyan entre otros aspectos como el crecimiento de la población y la producción de residuos (Decreto 1077 de 2015, Artículo 2.3.2.2.1.7.)","Variable 2 Total de hogares: corresponde a la totalidad de hogares urbanos que Colombia posee","Creciente","2017-12-31","Encuesta de Calidad de Vida  del Departamento Administrativo Nacional de Estadística (DANE)",210,"Anual","Resultado","Número",0,2373,2967,3560,2967,11867,"DPR-Dirección de Política y Regulación",false,null,null,"PND",null,null,"Estructural","VIII. Pacto por la calidad y eficiencia de los servicios públicos: agua y energía para promover la competitividad y el bienestar de todos\n\nXIX. Pacto Seaflower Región: Por una región próspera, segura y sostenible San Andrés","B. Agua limpia y saneamiento básico adecuado: hacia una gestión responsable, sostenible y equitativa\n\nTransversal","Objetivo 1. Implementar estrategias para el logro de una prestación eficiente, sostenible e incluyente de los servicios de APSB con orientación regional, y una política nacional de gestión integral de residuos sólidos que articule el concepto de economía circular"]
["Nuevas personas con acceso a soluciones adecuadas para el manejo de aguas residuales (Amazonía)","Agua Potable y Saneamiento Básico","Mejorar la cobertura, calidad y continuidad de los servicios de Agua Potable y Saneamiento Básico","Aumentar coberturas de acueducto y alcantarillado en zonas rurales y zonas urbanas con grandes brechas","VIII. Pacto por la calidad y eficiencia de los servicios públicos: agua y energía para promover la competitividad y el bienestar de todos\n\nXXII. Pacto Región Amazonía: Desarrollo sostenible por una Amazonia viva","B. Agua limpia y saneamiento básico adecuado: hacia una gestión responsable, sostenible y equitativa\n\nTransversal","Objetivo 1. Implementar estrategias para el logro de una prestación eficiente, sostenible e incluyente de los servicios de APSB con orientación regional, y una política nacional de gestión integral de residuos sólidos que articule el concepto de economía circular","ODS 6. Agua limpia y saneamiento","ODS 11. Ciudades y comunidades sostenibles","Dimensión 3. Gestión con Valores para Resultados","Gestión a la Política de Agua Potable y Saneamiento Básico","Nuevas personas con acceso a soluciones adecuadas para el manejo de aguas residuales (Amazonía)","Número total de personas nuevas con acceso a soluciones adecuadas para el manejo de aguas residuales en la región Amazonía","Establecer el porcentaje de hogares rurales con acceso a soluciones adecuadas de agua potable en municipios PDET","Variable 1 Hogares rurales con acceso a soluciones adecuadas de agua potable en municipios PDET: mide el aumento en el porcentaje de hogares rurales con acceso a soluciones adecuadas de agua potable de los municipios que hacen parte del Programa de Desarrollo con Enfoque Territorial (PDET), a través del cual se hace seguimiento al mejoramiento de la calidad de vida de la población ubicada en esta zona. ",null,"Creciente ","2018-12-31","Superintendencia de Servicios Públicos Domiciliarios (SSPD): \nSistema Único de Información (SUI)\nReporte de Estratificación y Coberturas (REC)\nDepartamento Administrativo Nacional de Estadística (DANE):\nProyecciones de población del Censo 2005 o 2018  \nGran Encuenta Integrada de Hogares (GEIH) - Promedio de personas por hogar",180,"Anual","Resultado","Número",0,6322,7903,9483,7902,31610,"DPR-Dirección de Política y Regulación",false,null,null,"PND",null,null,"Estructural","VIII. Pacto por la calidad y eficiencia de los servicios públicos: agua y energía para promover la competitividad y el bienestar de todos\n\nXXII. Pacto Región Amazonía: Desarrollo sostenible por una Amazonia viva","B. Agua limpia y saneamiento básico adecuado: hacia una gestión responsable, sostenible y equitativa\n\nTransversal","Objetivo 1. Implementar estrategias para el logro de una prestación eficiente, sostenible e incluyente de los servicios de APSB con orientación regional, y una política nacional de gestión integral de residuos sólidos que articule el concepto de economía circular"]
["Nuevas personas con acceso a soluciones adecuadas para el manejo de aguas residuales (Pacífico)","Agua Potable y Saneamiento Básico","Mejorar la cobertura, calidad y continuidad de los servicios de Agua Potable y Saneamiento Básico","Aumentar coberturas de acueducto y alcantarillado en zonas rurales y zonas urbanas con grandes brechas","VIII. Pacto por la calidad y eficiencia de los servicios públicos: agua y energía para promover la competitividad y el bienestar de todos\n\nXVII. Pacto Región Pacífico: Diversidad para la equidad, la convivencia pacífica y el desarrollo sostenible","B. Agua limpia y saneamiento básico adecuado: hacia una gestión responsable, sostenible y equitativa\n\nTransversal","Objetivo 1. Implementar estrategias para el logro de una prestación eficiente, sostenible e incluyente de los servicios de APSB con orientación regional, y una política nacional de gestión integral de residuos sólidos que articule el concepto de economía circular","ODS 6. Agua limpia y saneamiento","ODS 11. Ciudades y comunidades sostenibles","Dimensión 3. Gestión con Valores para Resultados","Gestión a la Política de Agua Potable y Saneamiento Básico","Nuevas personas con acceso a soluciones adecuadas para el manejo de aguas residuales (Pacífico)","Número de nuevas personas beneficiadas con soluciones adecuadas para el manejo de aguas residuales en la región Pacífico","Establecer el porcentaje de hogares rurales con acceso a soluciones adecuadas para el manejo de aguas residuales en municipios PDET","Variable 1 Hogares rurales con acceso a soluciones adecuadas para el manejo de aguas residuales en municipios PDET : Este indicador mide el aumento en el porcentaje de hogares rurales con acceso a soluciones adecuadas para el manejo de aguas residuales de los municipios que hacen parte del Programa de Desarrollo con Enfoque Territorial (PDET), a través del cual se hace seguimiento al mejoramiento de la calidad de vida de la población ubicada en esta zona. Para obtener el valor del indicador se calculará el porcentaje de hogares en zona rural de los municipios PDET que han sido beneficiados con proyectos de acceso a métodos adecuados de saneamiento. Soluciones adecuadas de saneamiento se refiere a: inodoro conectado a alcantarillado o a pozo séptico.",null,"Creciente","2018-12-31","Superintendencia de Servicios Públicos Domiciliarios (SSPD): \nSistema Único de Información (SUI)\nReporte de Estratificación y Coberturas (REC)\nDepartamento Administrativo Nacional de Estadística (DANE):\nProyecciones de población del Censo 2005 o 2018  \nGran Encuenta Integrada de Hogares (GEIH) - Promedio de personas por hogar",180,"Anual","Resultado","Número",0,81049,101311,121574,101311,405245,"DPR-Dirección de Política y Regulación",false,null,null,"PND",null,null,"Estructural","VIII. Pacto por la calidad y eficiencia de los servicios públicos: agua y energía para promover la competitividad y el bienestar de todos\n\nXVII. Pacto Región Pacífico: Diversidad para la equidad, la convivencia pacífica y el desarrollo sostenible","B. Agua limpia y saneamiento básico adecuado: hacia una gestión responsable, sostenible y equitativa\n\nTransversal","Objetivo 1. Implementar estrategias para el logro de una prestación eficiente, sostenible e incluyente de los servicios de APSB con orientación regional, y una política nacional de gestión integral de residuos sólidos que articule el concepto de economía circular"]
["Personas con acceso a soluciones adecuadas de agua potable (Totaliza)","Agua Potable y Saneamiento Básico","Mejorar la cobertura, calidad y continuidad de los servicios de Agua Potable y Saneamiento Básico","Aumentar coberturas de acueducto y alcantarillado en zonas rurales y zonas urbanas con grandes brechas","VIII. Pacto por la calidad y eficiencia de los servicios públicos: agua y energía para promover la competitividad y el bienestar de todos","B. Agua limpia y saneamiento básico adecuado: hacia una gestión responsable, sostenible y equitativa","Objetivo 1. Implementar estrategias para el logro de una prestación eficiente, sostenible e incluyente de los servicios de APSB con orientación regional, y una política nacional de gestión integral de residuos sólidos que articule el concepto de economía circular","ODS 6. Agua limpia y saneamiento","ODS 11. Ciudades y comunidades sostenibles","Dimensión 3. Gestión con Valores para Resultados","Gestión a la Política de Agua Potable y Saneamiento Básico","Personas con acceso a soluciones adecuadas de agua potable (Totaliza)","Número de personas con acceso a soluciones adecuadas de agua potable ","Identificar el número de municipios de Colombia en alto riesgo ","Variable 1 Municipios con riesgo alto: Son definidos por estudios técnicos, en los cuales se desarrollan un análisis y una evaluación a escala detallada, considerando la información sobre los elementos expuestos (personas, bienes e infraestructura) ante una amenaza específica (los estudios técnicos se estructuran con los datos de la vigencia inmediatamente anterior al cálculo del indicador). La espacialización dada para la zona de alto riesgo permite identificar los municipios que se encuentran bajo esta condición. \nEl riesgo aquí referido es el que comprende los daños y/o pérdidas de tipo social, cultural, económico y ambiental asociadas con fenómenos destructivos naturales, socio-naturales, tecnológicos o humanos no intencionales. \nLas condiciones de riesgo en el municipio son dinámicas, es decir cambian con el tiempo, tanto en sus características como en su nivel; siempre aumentando, a no ser que se tenga una estrategia consciente y decidida de reducción tanto de las condiciones de riesgo actual como las futuras.","Variable 2 Total Municipios: corresponde a la totalidad de municipios que Colombia posee, 1.103 municipios registrados en el DANE","Decreciente ","2019-12-31","Dirección de Política y Regulación (DPR)","NA","Anual","Resultado","Número",44487945,45093945,45851445,46760445,47517945,47517945,"DPR-Dirección de Política y Regulación",false,null,null,"PND",null,null,"Estructural","VIII. Pacto por la calidad y eficiencia de los servicios públicos: agua y energía para promover la competitividad y el bienestar de todos","B. Agua limpia y saneamiento básico adecuado: hacia una gestión responsable, sostenible y equitativa","Objetivo 1. Implementar estrategias para el logro de una prestación eficiente, sostenible e incluyente de los servicios de APSB con orientación regional, y una política nacional de gestión integral de residuos sólidos que articule el concepto de economía circular"]
["Personas con acceso a soluciones adecuadas de agua potable en zona rural ","Agua Potable y Saneamiento Básico","Mejorar la cobertura, calidad y continuidad de los servicios de Agua Potable y Saneamiento Básico","Aumentar coberturas de acueducto y alcantarillado en zonas rurales y zonas urbanas con grandes brechas","VIII. Pacto por la calidad y eficiencia de los servicios públicos: agua y energía para promover la competitividad y el bienestar de todos","B. Agua limpia y saneamiento básico adecuado: hacia una gestión responsable, sostenible y equitativa","Objetivo 1. Implementar estrategias para el logro de una prestación eficiente, sostenible e incluyente de los servicios de APSB con orientación regional, y una política nacional de gestión integral de residuos sólidos que articule el concepto de economía circular","ODS 6. Agua limpia y saneamiento","ODS 11. Ciudades y comunidades sostenibles","Dimensión 3. Gestión con Valores para Resultados","Gestión a la Política de Agua Potable y Saneamiento Básico","Personas con acceso a soluciones adecuadas de agua potable en zona rural ","Número de personas con acceso a soluciones adecuadas de agua potable en zona rural ","Establecer el porcentaje de municipios que tratan adecuadamente los residuos sólidos ","Variable 1 Municipios que tratan adecuadamente los residuos sólidos: reporta el porcentaje de municipios que cuentan con un sistema de tratamiento adecuado de los residuos sólidos producidos en su territorio ya sea mediante relleno saniatrio, celdas de contingencia y /o procesos de aprovechamiento.","Variable 2 Total Municipios: corresponde a la totalidad de municipios que Colombia posee, 1.103 municipios registrados en el DANE ","Creciente ","2016-12-31","Superintendencia de Servicios Públicos Domiciliarios (SSPD)",180,"Anual","Resultado","Número",7832470,7938470,8070970,8229970,8362470,8362470,"DPR-Dirección de Política y Regulación",false,null,null,"PND",null,null,"Estructural\n\n\n\n\n\n\n\nTransversal","VIII. Pacto por la calidad y eficiencia de los servicios públicos: agua y energía para promover la competitividad y el bienestar de todos","B. Agua limpia y saneamiento básico adecuado: hacia una gestión responsable, sostenible y equitativa","Objetivo 1. Implementar estrategias para el logro de una prestación eficiente, sostenible e incluyente de los servicios de APSB con orientación regional, y una política nacional de gestión integral de residuos sólidos que articule el concepto de economía circular"]
["Personas con acceso a soluciones adecuadas de agua potable en zona urbana","Agua Potable y Saneamiento Básico","Mejorar la cobertura, calidad y continuidad de los servicios de Agua Potable y Saneamiento Básico","Aumentar coberturas de acueducto y alcantarillado en zonas rurales y zonas urbanas con grandes brechas","VIII. Pacto por la calidad y eficiencia de los servicios públicos: agua y energía para promover la competitividad y el bienestar de todos","B. Agua limpia y saneamiento básico adecuado: hacia una gestión responsable, sostenible y equitativa","Objetivo 1. Implementar estrategias para el logro de una prestación eficiente, sostenible e incluyente de los servicios de APSB con orientación regional, y una política nacional de gestión integral de residuos sólidos que articule el concepto de economía circular","ODS 6. Agua limpia y saneamiento","ODS 11. Ciudades y comunidades sostenibles","Dimensión 3. Gestión con Valores para Resultados","Gestión a la Política de Agua Potable y Saneamiento Básico","Personas con acceso a soluciones adecuadas de agua potable en zona urbana","Número de personas con acceso a soluciones adecuadas de agua potable en zona urbana","Incentivar el tratamiento y aprovechamiento de residuos sólidos","Variable 1. Toneladas efectivamente aprovechadas: toneladas efectivamente aprovechadas que los prestadores del servicio público de aseo en la actividad de aprovechamiento registran ante el Sistema Único de Información (SUI) de la SSPD","Variable 2. Toneladas dispuestas más Toneladas efectivamente aprovechadas: total de toneladas reportadas de disposición final más toneladas efectivamente aprovechadas registradas por los prestadores al SUI de la SSPD","Creciente","2017-12-31","Superintendencia de Servicios Públicos Domiciliarios (SSPD)",180,"Anual","Resultado","Número",36655475,37155475,37780475,38530475,39155475,39155475,"DPR-Dirección de Política y Regulación",false,null,null,"PND",0,null,"\n\n\nTransversal","VIII. Pacto por la calidad y eficiencia de los servicios públicos: agua y energía para promover la competitividad y el bienestar de todos","B. Agua limpia y saneamiento básico adecuado: hacia una gestión responsable, sostenible y equitativa","Objetivo 1. Implementar estrategias para el logro de una prestación eficiente, sostenible e incluyente de los servicios de APSB con orientación regional, y una política nacional de gestión integral de residuos sólidos que articule el concepto de economía circular","ODS 11. Ciudades y comunidades sostenibles","NO"]
["Personas con acceso a soluciones adecuadas para el manejo de aguas residuales (Totaliza)","Agua Potable y Saneamiento Básico","Mejorar la cobertura, calidad y continuidad de los servicios de Agua Potable y Saneamiento Básico","Aumentar coberturas de acueducto y alcantarillado en zonas rurales y zonas urbanas con grandes brechas","VIII. Pacto por la calidad y eficiencia de los servicios públicos: agua y energía para promover la competitividad y el bienestar de todos\n\nXVII. Pacto Región Pacífico: Diversidad para la equidad, la convivencia pacífica y el desarrollo sostenible","B. Agua limpia y saneamiento básico adecuado: hacia una gestión responsable, sostenible y equitativa\n\nTransversal","Objetivo 1. Implementar estrategias para el logro de una prestación eficiente, sostenible e incluyente de los servicios de APSB con orientación regional, y una política nacional de gestión integral de residuos sólidos que articule el concepto de economía circular","ODS 6. Agua limpia y saneamiento","ODS 11. Ciudades y comunidades sostenibles","Dimensión 3. Gestión con Valores para Resultados","Gestión a la Política de Agua Potable y Saneamiento Básico","Personas con acceso a soluciones adecuadas para el manejo de aguas residuales (Totaliza)","Número de personas con acceso a soluciones adecuadas para el manejo de aguas residuales ","Medir el avance en la construcción de la reglamentación en el marco de la Comisión de Impulso del Decreto 1953, citada por el Ministerio del Inteiror","Variable 1 Reglamentación en el marco de la Comisión de Impulso del Decreto 1953: corresponde al avance en la construcción de la reglamentación en el marco de la Comisión de Impulso del Decreto 1953, citada por el Ministerio del Interior",null,"Creciente","2018-12-31","Dirección de Política y Regulación (DPR)",0,"Anual","Resultado","Número",42855593,43511593,44331593,45315593,46135593,46135593,"DPR-Dirección de Política y Regulación",false,null,null,"PND",90,null,"Estructural","VIII. Pacto por la calidad y eficiencia de los servicios públicos: agua y energía para promover la competitividad y el bienestar de todos\n\nXVII. Pacto Región Pacífico: Diversidad para la equidad, la convivencia pacífica y el desarrollo sostenible","B. Agua limpia y saneamiento básico adecuado: hacia una gestión responsable, sostenible y equitativa\n\nTransversal","Objetivo 1. Implementar estrategias para el logro de una prestación eficiente, sostenible e incluyente de los servicios de APSB con orientación regional, y una política nacional de gestión integral de residuos sólidos que articule el concepto de economía circular","ODS 11. Ciudades y comunidades sostenibles","NO "]
["Personas con acceso a soluciones adecuadas para el manejo de aguas residuales en zona rural ","Agua Potable y Saneamiento Básico","Mejorar la cobertura, calidad y continuidad de los servicios de Agua Potable y Saneamiento Básico","Aumentar coberturas de acueducto y alcantarillado en zonas rurales y zonas urbanas con grandes brechas","VIII. Pacto por la calidad y eficiencia de los servicios públicos: agua y energía para promover la competitividad y el bienestar de todos","B. Agua limpia y saneamiento básico adecuado: hacia una gestión responsable, sostenible y equitativa","Objetivo 1. Implementar estrategias para el logro de una prestación eficiente, sostenible e incluyente de los servicios de APSB con orientación regional, y una política nacional de gestión integral de residuos sólidos que articule el concepto de economía circular","ODS 6. Agua limpia y saneamiento","ODS 1. Fin de la pobreza","Dimensión 3. Gestión con Valores para Resultados","Gestión a la Política de Agua Potable y Saneamiento Básico","Personas con acceso a soluciones adecuadas para el manejo de aguas residuales en zona rural ","Número de personas con acceso a soluciones adecuadas para el manejo de aguas residuales en zona rural ","Reporta la relación entre los residuos sólidos que han sido dispuestos bajo una técnica adecuada (Relleno sanitario, planta integral, celda de contingencia) y aquellos residuos sólidos dispuestos de forma inadecuada (Celda de transición, Botadero a Cielo Abierto, Quemas, vertimiento a cuerpos de agua)","Variable 1 Toneladas dispuestas en un sitio de disposición final adecuado: reporta las toneladas de residuos sólidos dispuestos bajo una técnica adecuada (relleno sanitario, planta integral, celda de contingencia) ","Variable 2 Total toneladas dispuestas: corresponden a la totalidad de toneladas de residuos sólidos que llegan a disposición final (adecuada e inadecuada)","Creciente ","2017-12-31","Superintendencia de Servicios Públicos Domiciliarios (SSPD)",180,"Anual","Resultado","Número",8089327,8185327,8305327,8449327,8569327,8569327,"DPR-Dirección de Política y Regulación",false,null,null,"PND",90,"PES","Estructural","VIII. Pacto por la calidad y eficiencia de los servicios públicos: agua y energía para promover la competitividad y el bienestar de todos","B. Agua limpia y saneamiento básico adecuado: hacia una gestión responsable, sostenible y equitativa","Objetivo 1. Implementar estrategias para el logro de una prestación eficiente, sostenible e incluyente de los servicios de APSB con orientación regional, y una política nacional de gestión integral de residuos sólidos que articule el concepto de economía circular","ODS 11. Ciudades y comunidades sostenibles","SI"]
["Personas con acceso a soluciones adecuadas para el manejo de aguas residuales en zona urbana ","Agua Potable y Saneamiento Básico","Mejorar la cobertura, calidad y continuidad de los servicios de Agua Potable y Saneamiento Básico","Aumentar coberturas de acueducto y alcantarillado en zonas rurales y zonas urbanas con grandes brechas","VIII. Pacto por la calidad y eficiencia de los servicios públicos: agua y energía para promover la competitividad y el bienestar de todos","B. Agua limpia y saneamiento básico adecuado: hacia una gestión responsable, sostenible y equitativa","Objetivo 1. Implementar estrategias para el logro de una prestación eficiente, sostenible e incluyente de los servicios de APSB con orientación regional, y una política nacional de gestión integral de residuos sólidos que articule el concepto de economía circular","ODS 6. Agua limpia y saneamiento","ODS 11. Ciudades y comunidades sostenibles","Dimensión 3. Gestión con Valores para Resultados","Gestión a la Política de Agua Potable y Saneamiento Básico","Personas con acceso a soluciones adecuadas para el manejo de aguas residuales en zona urbana ","Número de personas con acceso a soluciones adecuadas para el manejo de aguas residuales en zona urbana","Medir el número de asistencias técnicas para la formulación de proyectos presentados por las comunidades","Variable 1 Asistencias Técnicas Atendidas: corresponde al número de asistencias técnicas prestadas por el VASB","Variable 2 Asistencias Técnicas Solicitadas: corresponde al número de asistencias técnicas solicitadas al VASB","Constante","2018-12-31","Dirección de Política y Regulación (DPR)",0,"Anual","Resultado","Número",34766266,35326266,36026266,36866266,37566266,37566266,"DPR-Dirección de Política y Regulación",false,null,null,"PND",90,null,"Estructural","VIII. Pacto por la calidad y eficiencia de los servicios públicos: agua y energía para promover la competitividad y el bienestar de todos","B. Agua limpia y saneamiento básico adecuado: hacia una gestión responsable, sostenible y equitativa","Objetivo 1. Implementar estrategias para el logro de una prestación eficiente, sostenible e incluyente de los servicios de APSB con orientación regional, y una política nacional de gestión integral de residuos sólidos que articule el concepto de economía circular","ODS 11. Ciudades y comunidades sostenibles","NO "]
["Decreto expedido en 2019","Vivienda","Aumentar el acceso a vivienda digna","Profundizar el acceso a soluciones de vivienda digna a los hogares de menores ingresos.","XII. Pacto por la equidad de oportunidades para grupos étnicos: Indígenas, Negros, Afrocolombianos, Raizales, Palenqueros y Rrom","C. Capítulo de Rrom","Objetivo 6. Mejorar condiciones físicas y sociales de viviendas y entornos, a través de la implementación de políticas diferenciales, para el mejoramiento de las condiciones de habitabilidad de los hogares con menores ingresos en entornos rurales y urbanas","ODS 11. Ciudades y comunidades sostenibles","ODS 1. Fin de la pobreza","Dimensión 3. Gestión con Valores para Resultados","Gestión a la Política de Vivienda","Decreto expedido en 2019","Sumatoria del número de decretos expedidos","Garantizar el acceso a vivienda urbana a través de la elaboración de instrumentos normativos ","Variable 1 Decretos expedidos:  representa la sumatoria del número de decretos expedidos referente al criterio de focalización para el acceso al subsidio familiar de vivienda, para áreas urbanas, de los hogares que pertenezcan a los grupos señalados, incluyendo Rrom, en atención a su situación de vulnerabilidad",null,"Suma","2018-12-31","Ministerio de Vivienda Ciudad y Territorio",0,"Anual","Eficiencia","Número",0,1,1,0,0,1,"DSH-Dirección del Sistema Habitacional",false,null,null,"PND",null,"PES","Estructural","XII. Pacto por la equidad de oportunidades para grupos étnicos: Indígenas, Negros, Afrocolombianos, Raizales, Palenqueros y Rrom","C. Capítulo de Rrom","Objetivo 6. Mejorar condiciones físicas y sociales de viviendas y entornos, a través de la implementación de políticas diferenciales, para el mejoramiento de las condiciones de habitabilidad de los hogares con menores ingresos en entornos rurales y urbanas"]
["Documento normativo donde se establezcan los porcentajes participación de las mujeres cabeza de familia(…)","Vivienda","Aumentar el acceso a vivienda digna","Profundizar el acceso a soluciones de vivienda digna a los hogares de menores ingresos.","XII. Pacto por la equidad de oportunidades para grupos étnicos: Indígenas, Negros, Afrocolombianos, Raizales, Palenqueros y Rrom","D. Capítulo de comunidades negras, afrocolombianas, raizales y palenqueras","Objetivo 1. Mejorar las condiciones físicas y sociales de viviendas, entornos y asentamientos precarios, a través de la implementación de políticas para el mejoramiento de vivienda y barrios para los hogares de menores ingresos","ODS 11. Ciudades y comunidades sostenibles","ODS 1. Fin de la pobreza","Dimensión 3. Gestión con Valores para Resultados","Gestión a la Política de Vivienda","Documento normativo donde se establezcan los porcentajes participación de las mujeres cabeza de familia(…)","Sumatoria de documentos normativos publicados","Garantizar el acceso a vivienda urbana a través de la elaboración y publicación de instrumentos normativos para las mujeres cabeza de familia y que adicionalmente el hogar o uno de sus miembros pertenecen a comunidades Negras, Afrocolombiana, Raizales y Palanqueras, para que tengan acceso a subsidio de vivienda y cuenten con una solución habitacional digna","Variable 1 - Documentos Normativos Publicados: representa la sumatoria del número de documentos normativos publicados referente al criterio de focalización de porcentajes participación de las mujeres cabeza de familia y que adicionalmente el hogar o uno de sus miembros pertenecen a comunidades Negras, Afrocolombiana, Raizales y Palanqueras, para que tengan acceso a subsidio de vivienda y cuenten con una solución habitacional digna",null,"Suma","2018-12-31","Informes de enfoque diferencial para comunidades negras, afrocolombianas, raizales y palenqueras","NA","Anual","Producto","Número",0,0,1,1,0,1,"DSH-Dirección del Sistema Habitacional",{"$f":"H71=I71","v":false},null,null,"PND",30,"PES","Estructural","XII. Pacto por la equidad de oportunidades para grupos étnicos: Indígenas, Negros, Afrocolombianos, Raizales, Palenqueros y Rrom","D. Capítulo de comunidades negras, afrocolombianas, raizales y palenqueras","Objetivo 1. Mejorar las condiciones físicas y sociales de viviendas, entornos y asentamientos precarios, a través de la implementación de políticas para el mejoramiento de vivienda y barrios para los hogares de menores ingresos","ODS 11. Ciudades y comunidades sostenibles","SI"]
["Empresas beneficiadas con el programa de Fábricas de Productividad para la Construcción","Vivienda","Aumentar el acceso a vivienda digna","Promover la productividad del sector de la construcción","III. Pacto por la Equidad: política social moderna centrada en la familia, eficiente, de calidad y conectada a mercados","E. Vivienda y entornos dignos e incluyentes","Objetivo 3. Incrementar la productividad del sector de la construcción, a través del fortalecimiento y la formalización de la mano de obra, la mejora de procesos constructivos y la adopción de tecnologías y buenas prácticas gerenciales","ODS 11. Ciudades y comunidades sostenibles","-","Dimensión 2. Direccionamiento Estratégico y Planeación ","Gestión a la Política de Vivienda","Empresas beneficiadas con el programa de Fábricas de Productividad para la Construcción","Sumatoria de empresas beneficiadas con el programa de Fábricas de Productividad para la Construcción","Identificar el número de empresas que reciben servicios de extensionismo tecnológico para aumentar la productividad de su actividad económica a través de la mejora de su procesos","Variable 1 Empresas beneficiadas con el programa de Fábricas de Productividad para la Construcción: número de empresas que reciben servicios de extensión tecnólogica a través del programa de Fabricas de Productividad en uno o dos de los nueve ejes definidos por el Programa de Transformación Productiva.",null,"Suma","2019-12-31","Colombia Productiva\nRegistro de empresas beneficiarias del Programa de Transformación Productiva -PTP ",0,"Anual ","Producto","Número",0,50,30,38,0,118,"DSH-Dirección del Sistema Habitacional",false,null,null,"Gestión",null,null,"Transversal\n\n\n\n\n\n\n\n\n\nEstructural","III. Pacto por la Equidad: política social moderna centrada en la familia, eficiente, de calidad y conectada a mercados","E. Vivienda y entornos dignos e incluyentes","Objetivo 3. Incrementar la productividad del sector de la construcción, a través del fortalecimiento y la formalización de la mano de obra, la mejora de procesos constructivos y la adopción de tecnologías y buenas prácticas gerenciales"]
["Estudios del sector de la construcción y vivienda publicados","Vivienda","Robustecer la capacidad de gestión y desempeño de las entidades del sector","Promover la implementación de la gestión del conocimiento e innovación en el ministerio","V. Pacto por la ciencia, la tecnología y la innovación: un sistema para construir el conocimiento de la Colombia del futuro","D. Innovación pública para un país moderno","Objetivo 5. Gestionar el conocimiento y los aprendizajes para crear valor público","ODS 11. Ciudades y comunidades sostenibles","ODS 16. Paz, justicia e instituciones sólidas","Dimensión 6. Gestión del Conocimiento ","Gestión a la Política de Vivienda","Estudios del sector de la construcción y vivienda publicados","Sumatoria de estudios del sector de la construcción y vivienda publicados","Gestionar el conocimiento y los aprendizajes para crear valor público, realizando estudios de evaluación de impacto. Así como \nProveer insumos para el seguimiento, mejoramiento y formulación de la politica pública de vivienda","Variable 1 - Estudios del sector de la construcción y vivienda publicados: representa la sumatoria del número de estudios del Sector de la Construcción y vigencia publicados en la vigencia correspondiente",null,"Suma","2018-12-31","DANE - Superintendencia Financiera  - Fonvivienda","NA","Anual ","Producto","Número",2,6,7,5,7,25,"DSH-Dirección del Sistema Habitacional",false,null,null,"Gestión",null,null,"Transversal","V. Pacto por la ciencia, la tecnología y la innovación: un sistema para construir el conocimiento de la Colombia del futuro","D. Innovación pública para un país moderno","Objetivo 5. Gestionar el conocimiento y los aprendizajes para crear valor público"]
["Mesa de trabajo con el sector financiero para proponer una línea de crédito flexible con bajas tasa de interés dirigida a grupos étnicos para adquisición de vivienda nueva","Vivienda","Aumentar el acceso a vivienda digna","Profundizar el acceso a soluciones de vivienda digna a los hogares de menores ingresos.","XII. Pacto por la equidad de oportunidades para grupos étnicos: Indígenas, Negros, Afrocolombianos, Raizales, Palenqueros y Rrom","C. Capítulo de Rrom","Objetivo 6. Mejorar condiciones físicas y sociales de viviendas y entornos, a través de la implementación de políticas diferenciales, para el mejoramiento de las condiciones de habitabilidad de los hogares con menores ingresos en entornos rurales y urbanas","ODS 11. Ciudades y comunidades sostenibles","ODS 1. Fin de la pobreza","Dimensión 3. Gestión con Valores para Resultados","Gestión a la Política de Vivienda","Mesa de trabajo con el sector financiero para proponer una línea de crédito flexible con bajas tasa de interés dirigida a grupos étnicos para adquisición de vivienda nueva","Sumatoria del número de mesas realizadas","Promover el acceso a vivienda nueva con buenas condiciones de habitabilidad a hogares con menores ingresos en entornos rurales y urbanos, pertenecientes a grupos étnicos","Variable 1 Mesa de trabajo: representa la sumatoria del número de mesas de trabajo con el sector financiero realizadas en una vigencia correspondiente",null,"Suma","2019-12-31"," Ministerio de Vivienda, Ciudad y Territorio",0,"Anual","Eficiencia","Número",0,0,1,0,0,1,"DSH-Dirección del Sistema Habitacional",false,null,null,"PND",null,null,"Transversal","XII. Pacto por la equidad de oportunidades para grupos étnicos: Indígenas, Negros, Afrocolombianos, Raizales, Palenqueros y Rrom","C. Capítulo de Rrom","Objetivo 6. Mejorar condiciones físicas y sociales de viviendas y entornos, a través de la implementación de políticas diferenciales, para el mejoramiento de las condiciones de habitabilidad de los hogares con menores ingresos en entornos rurales y urbanas"]
["Porcentaje de hogares urbanos con déficit cualitativo de vivienda ","Vivienda","Aumentar el acceso a vivienda digna","Profundizar el acceso a soluciones de vivienda digna a los hogares de menores ingresos.","III. Pacto por la Equidad: política social moderna centrada en la familia, eficiente, de calidad y conectada a mercados","E. Vivienda y entornos dignos e incluyentes","Objetivo 2. Profundizar el acceso a soluciones de vivienda digna, a través de la complementariedad de esquemas de compra y arriendo subsidiado de vivienda y la facilitación del financiamiento formal a los hogares de menores ingresos","ODS 11. Ciudades y comunidades sostenibles","-","Dimensión 3. Gestión con Valores para Resultados","Gestión a la Política de Vivienda","Porcentaje de hogares urbanos con déficit cualitativo de vivienda ","(Número de hogares urbanos en déficit cualitativo / Número total de hogares urbanos)*100","Mide el porcentaje de hogares urbanos que habitan en viviendas particulares que presentan carencias habitacionales en los atributos referentes a la estructura, espacio y a la disponibilidad de servicios públicos domiciliarios y, por tanto, requieren mejoramiento o ampliación de la unidad habitacional en la cual viven.","Variable 1 Hogares urbanos en déficit cualitativo: representa el porcentaje de hogares urbanos en déficit cualitativo de vivienda, es decir, aquellas viviendas particulares que presentan carencias habitacionales en los atributos referentes a la estructura, espacio y a la disponibilidad de servicios públicos domiciliarios y por tanto, requieren mejoramiento o ampliación de la unidad habitacional en la cual viven.","Variable 2 Hogares urbanos: correponde al número total de hogares urbanos en colombia","Decreciente ","2017-12-31","Cálculos Ministerio de Vivienda y Departamento Nacional de Planeación con base en DANE - Gran Encuesta Integrada de Hogares (GEIH)",90,"Anual","Eficiencia","Porcentaje",9.75,9.4,9.1,8.8000000000000007,8.5,8.5,"DSH-Dirección del Sistema Habitacional",false,null,null,"PND",null,null,"Estructural ","III. Pacto por la Equidad: política social moderna centrada en la familia, eficiente, de calidad y conectada a mercados","E. Vivienda y entornos dignos e incluyentes","Objetivo 2. Profundizar el acceso a soluciones de vivienda digna, a través de la complementariedad de esquemas de compra y arriendo subsidiado de vivienda y la facilitación del financiamiento formal a los hogares de menores ingresos"]
["Porcentaje de hogares urbanos con déficit cuantitativo de vivienda","Vivienda","Aumentar el acceso a vivienda digna","Profundizar el acceso a soluciones de vivienda digna a los hogares de menores ingresos.","III. Pacto por la Equidad: política social moderna centrada en la familia, eficiente, de calidad y conectada a mercados","E. Vivienda y entornos dignos e incluyentes","Objetivo 2. Profundizar el acceso a soluciones de vivienda digna, a través de la complementariedad de esquemas de compra y arriendo subsidiado de vivienda y la facilitación del financiamiento formal a los hogares de menores ingresos","ODS 11. Ciudades y comunidades sostenibles","-","Dimensión 4. Evaluación de Resultados","Gestión a la Política de Vivienda","Porcentaje de hogares urbanos con déficit cuantitativo de vivienda","(Número de hogares urbanos en déficit cuantitativo/Número total de hogares urbanos)*100","Mide el porcentaje de hogares que requieren de una vivienda urbana para que exista una relación uno a uno entre las viviendas adecuadas y los hogares que necesitan alojamiento.","Variable 1 Hogares urbanos en déficit cuantitativo: representa el porcentaje de hogares urbanos en déficit cuantitativo de vivienda del número total de hogares urbanos y estima la cantidad de viviendas que la sociedad debe construir o adicionar para que exista una relación uno a uno entre las viviendas adecuadas y los hogares que necesitan alojamiento, es decir, se basa en la comparación entre el número de hogares y el número de viviendas apropiadas existentes.","Variable 2 Hogares urbanos: corresponde al número total de hogares urbanos en colombia","Decreciente","2017-12-31","Cálculos Ministerio de Vivienda y Departamento Nacional de Planeación con base en DANE - Gran Encuesta Integrada de Hogares (GEIH)",90,"Anual","Eficiencia","Porcentaje",5.22,4.66,4.4400000000000004,4.2200000000000006,4,4,"DSH-Dirección del Sistema Habitacional",false,null,null,"PND",null,null,"Estructural ","III. Pacto por la Equidad: política social moderna centrada en la familia, eficiente, de calidad y conectada a mercados","E. Vivienda y entornos dignos e incluyentes","Objetivo 2. Profundizar el acceso a soluciones de vivienda digna, a través de la complementariedad de esquemas de compra y arriendo subsidiado de vivienda y la facilitación del financiamiento formal a los hogares de menores ingresos"]
["Proyectos Normativos Publicados","Vivienda","Aumentar el acceso a vivienda digna","Profundizar el acceso a soluciones de vivienda digna a los hogares de menores ingresos.","III. Pacto por la Equidad: política social moderna centrada en la familia, eficiente, de calidad y conectada a mercados","E. Vivienda y entornos dignos e incluyentes","Objetivo 1. Mejorar las condiciones físicas y sociales de viviendas, entornos y asentamientos precarios, a través de la implementación de políticas para el mejoramiento de vivienda y barrios para los hogares de menores ingresos","ODS 11. Ciudades y comunidades sostenibles","ODS 1. Fin de la pobreza","Dimensión 3. Gestión con Valores para Resultados","Gestión a la Política de Vivienda","Proyectos Normativos Publicados","Número de proyectos normativos publicados","Garantizar el acceso a vivienda urbana a través de la publicación de instrumentos normativos ","Variable 1 - Proyectos normativos Publicados: representa la sumatoria del número de proyectos normativos publicados en una vigencia",null,"Suma","2018-12-31","Plan Nacional de Desarrollo y Necesidades Habitacionales Según Medición del Déficit","NA","Trimestral","Resultado","Número",0,0,0,3,4,7,"DSH-Dirección del Sistema Habitacional",false,null,null,"Gestión",null,null,"Estructural ","III. Pacto por la Equidad: política social moderna centrada en la familia, eficiente, de calidad y conectada a mercados","E. Vivienda y entornos dignos e incluyentes","Objetivo 1. Mejorar las condiciones físicas y sociales de viviendas, entornos y asentamientos precarios, a través de la implementación de políticas para el mejoramiento de vivienda y barrios para los hogares de menores ingresos"]
["Viviendas de Interés Social Urbanas iniciadas","Vivienda","Aumentar el acceso a vivienda digna","Profundizar el acceso a soluciones de vivienda digna a los hogares de menores ingresos.","III. Pacto por la Equidad: política social moderna centrada en la familia, eficiente, de calidad y conectada a mercados","E. Vivienda y entornos dignos e incluyentes","Objetivo 3. Incrementar la productividad del sector de la construcción, a través del fortalecimiento y la formalización de la mano de obra, la mejora de procesos constructivos y la adopción de tecnologías y buenas prácticas gerenciales","ODS 11. Ciudades y comunidades sostenibles","-","Dimensión 2. Direccionamiento Estratégico y Planeación ","Gestión a la Política de Vivienda","Viviendas de Interés Social Urbanas iniciadas","Acumulado trimestral del resultado que arroja el Modelo Ampliado DDU-DNP según el factor de expansión establecido por el DANE para el cálculo del PIB de edificaciones","Medir el número de Viviendas de Interés Social urbanas que inician construcción en un periodo determinado. La VIS urbana se entiende como aquella unidad habitacional cuyo valor comercial no supera el establecido legalmente a la fecha.","Variable 1 Acumulado trimestral del resultado que arroja el Modelo Ampliado DDU-DNP: representa la sumatoria del número de Viviendas de Interés Social Urbanas Iniciadas y que se entiende como aquellas edificaciones residenciales urbanas con un valor comercial inferior a los 135 SMMLV que iniciaron actividad constructora durante el período intercensal del Censo de Edificaciones del DANE. La categoría VIS recoge tambien a las Viviendas de Interés Prioritario (VIP) entendidas como aquellas unidades habitacionales con un valor comercial inferior a los 70 SMMLV",null,"Suma","2017-12-31","Modelo de iniciaciones DNP - DDU",90,"Trimestral","Producto","Número",492003,126229,123693,128790,141288,520000,"DSH-Dirección del Sistema Habitacional",false,null,null,"PND",null,null,"Estructural ","III. Pacto por la Equidad: política social moderna centrada en la familia, eficiente, de calidad y conectada a mercados","E. Vivienda y entornos dignos e incluyentes","Objetivo 3. Incrementar la productividad del sector de la construcción, a través del fortalecimiento y la formalización de la mano de obra, la mejora de procesos constructivos y la adopción de tecnologías y buenas prácticas gerenciales"]
["Viviendas urbanas de interés social tituladas","Vivienda","Aumentar el acceso a vivienda digna","Mejorar las condiciones físicas y sociales de viviendas, entornos y aglomeraciones humanas de desarrollo incompleto","III. Pacto por la Equidad: política social moderna centrada en la familia, eficiente, de calidad y conectada a mercados","E. Vivienda y entornos dignos e incluyentes","Objetivo 1. Mejorar las condiciones físicas y sociales de viviendas, entornos y asentamientos precarios, a través de la implementación de políticas para el mejoramiento de vivienda y barrios para los hogares de menores ingresos","ODS 11. Ciudades y comunidades sostenibles","ODS 1. Fin de la pobreza","Dimensión 2. Direccionamiento Estratégico y Planeación ","Gestión a la Política de Vivienda","Viviendas urbanas de interés social tituladas","Sumatoria del total de viviendas urbanas de interés social tituladas con el apoyo del MVCT","Medir el mecanismo por el cual el Gobierno Nacional faculta a las entidades públicas para transferir los predios de su propiedad ubicados en el perímetro urbano a las familias de escasos recursos que los han ocupado de manera ilegal con vivienda de interés social antes del 30 de noviembre de 2001","Variable 1 Viviendas urbanas de interés social tituladas: representa la sumatoria del número de viviendas urbanas de interés social tituladas en una vigencia correspondiente",null,"Suma","2018-12-31","Ministerio de Vivienda, Ciudad y Territorio y Superintendencia de Notariado y Registro",30,"Mensual ","Producto","Número",0,14150,14150,14150,14150,56600,"DSH-Dirección del Sistema Habitacional",false,null,null,"PND",null,null,"Estructural ","III. Pacto por la Equidad: política social moderna centrada en la familia, eficiente, de calidad y conectada a mercados","E. Vivienda y entornos dignos e incluyentes","Objetivo 1. Mejorar las condiciones físicas y sociales de viviendas, entornos y asentamientos precarios, a través de la implementación de políticas para el mejoramiento de vivienda y barrios para los hogares de menores ingresos"]
["Déficit cualitativo y cuantitativo de vivienda rural","Vivienda","Aumentar el acceso a vivienda digna","Profundizar el acceso a soluciones de vivienda digna a los hogares de menores ingresos.","III. Pacto por la Equidad: política social moderna centrada en la familia, eficiente, de calidad y conectada a mercados","E. Vivienda y entornos dignos e incluyentes","Objetivo 2. Profundizar el acceso a soluciones de vivienda digna, a través de la complementariedad de esquemas de compra y arriendo subsidiado de vivienda y la facilitación del financiamiento formal a los hogares de menores ingresos","ODS 11. Ciudades y comunidades sostenibles",null,"Dimensión 3. Gestión con Valores para Resultados","Gestión a la Política de Vivienda","Déficit cualitativo y cuantitativo de vivienda rural","(Número de Hogares rurales en condición de déficit (cualitativo y cuantitativo) de vivienda / Número Total de Hogares Rurales)*100","Medir el déficit tanto cualitativo como cuantitativo de vivienda en la zona rural del país, tomando como base los resultados de la Encuesta de Calidad de Vida que realiza anualmente el DANE","Variable 1:  Número de Hogares rurales en condición de déficit cualitiativo y cuantitativo de vivienda, donde el déficit cuantitativo hace referencia a los hogares que habitan en viviendas inadecuadas o construidas con material precario o inestable, hogares que comparten con otros la vivienda y hogares que residen en viviendas con hacinamiento no mitigable, entre tanto el déficit cualitativo enmarca hogares que habitan en viviendas construidas con materiales estables, pero con pisos inadecuados; hogares con hacinamiento mitigable; hogares que habitan en viviendas con servicios inadecuados y hogares en viviendas que no cuentan con un lugar adecuado para preparar los alimentos.","Variable 2: Número Total de Hogares Rurales, según los datos proporcionados por la Encuesta Calidad de Vida, publicada por el DANE.","Decreciente","2018-12-31","Encuesta de Calidad de Vida DANE - Departamento Nacional de Planeación DNP",210,"Anual","Resultado","Porcentaje",58.26,57.36,56.46,55.56,54.66,54.66,"DVR-Dirección de Vivienda Rural",false,null,null,"PND",null,null,"Transversal","III. Pacto por la Equidad: política social moderna centrada en la familia, eficiente, de calidad y conectada a mercados","E. Vivienda y entornos dignos e incluyentes","Objetivo 2. Profundizar el acceso a soluciones de vivienda digna, a través de la complementariedad de esquemas de compra y arriendo subsidiado de vivienda y la facilitación del financiamiento formal a los hogares de menores ingresos"]
["Déficit cualitativo y cuantitativo de vivienda rural en municipios PDET","Vivienda","Aumentar el acceso a vivienda digna","Profundizar el acceso a soluciones de vivienda digna a los hogares de menores ingresos.","III. Pacto por la Equidad: política social moderna centrada en la familia, eficiente, de calidad y conectada a mercados","E. Vivienda y entornos dignos e incluyentes","Objetivo 2. Profundizar el acceso a soluciones de vivienda digna, a través de la complementariedad de esquemas de compra y arriendo subsidiado de vivienda y la facilitación del financiamiento formal a los hogares de menores ingresos","ODS 11. Ciudades y comunidades sostenibles",null,"Dimensión 3. Gestión con Valores para Resultados","Gestión a la Política de Vivienda","Déficit cualitativo y cuantitativo de vivienda rural en municipios PDET","(Número de Hogares rurales en condición de déficit (cualitativo y cuantitativo) de vivienda en municipios PDET / Número Total de Hogares Rurales en municipios PDET)*100","Medir el déficit tanto cualitativo como cuantitativo de vivienda en la zona rural de los municipios PDET, tomando como base los resultados de la Encuesta de Calidad de Vida que realiza anualmente el DANE","Variable 1:  Número de Hogares rurales en condición de déficit cualitiativo y cuantitativo de vivienda en municipios PDET, donde el déficit cuantitativo hace referencia a los hogares que habitan en viviendas inadecuadas o construidas con material precario o inestable, hogares que comparten con otros la vivienda y hogares que residen en viviendas con hacinamiento no mitigable, entre tanto el déficit cualitativo enmarca hogares que habitan en viviendas construidas con materiales estables, pero con pisos inadecuados; hogares con hacinamiento mitigable; hogares que habitan en viviendas con servicios inadecuados y hogares en viviendas que no cuentan con un lugar adecuado para preparar los alimentos. ","Variable 2: Número Total de Hogares Rurales en municipios PDET, según los datos proporcionados por la Encuesta Calidad de Vida, publicada por el DANE.","Decreciente","2018-12-31","Encuesta de Calidad de Vida DANE - Departamento Nacional de Planeación DNP",210,"Anual","Resultado","Porcentaje",71.599999999999994,67.900000000000006,64.2,60.5,56.8,56.8,"DVR-Dirección de Vivienda Rural",false,null,null,"PND",null,null,"Transversal","III. Pacto por la Equidad: política social moderna centrada en la familia, eficiente, de calidad y conectada a mercados","E. Vivienda y entornos dignos e incluyentes","Objetivo 2. Profundizar el acceso a soluciones de vivienda digna, a través de la complementariedad de esquemas de compra y arriendo subsidiado de vivienda y la facilitación del financiamiento formal a los hogares de menores ingresos"]
["Documento de anexo técnico concertado de tipologías de vivienda de los pueblos indígenas","Vivienda","Aumentar el acceso a vivienda digna","Diseñar e implementar una política de vivienda de interés social rural que responda, de manera eficiente, a las necesidades habitacionales de los hogares que se encuentran en mayor vulnerabilidad socioeconómica","XII. Pacto por la equidad de oportunidades para grupos étnicos: Indígenas, Negros, Afrocolombianos, Raizales, Palenqueros y Rrom","B. Capítulo de grupos indígenas","Objetivo 6. Mejorar condiciones físicas y sociales de viviendas y entornos, a través de la implementación de políticas diferenciales, para el mejoramiento de las condiciones de habitabilidad de los hogares con menores ingresos en entornos rurales y urbanas","ODS 11. Ciudades y comunidades sostenibles","-","Dimensión 3. Gestión con Valores para Resultados","Gestión a la Política de Vivienda","Documento de anexo técnico concertado de tipologías de vivienda de los pueblos indígenas","Sumatoria de documentos técnicos elaborados","Medir la realización del documento que será construido de acuerdo con la metodología establecida en el Plan Nacional de Construcción y Mejoramiento de Vivienda Social Rural, donde se formulará la estrategia para la concertación de tipologías de vivienda con comunidades indígenas","Variable 1: Documento que tendrá las especificaciones técnicas de las viviendas concertadas con las comunidades indígenas",null,"Suma","NA","Dirección de Vivienda Rural ",30,"Anual","Producto","Número","N/D",0,1,1,0,1,"DVR-Dirección de Vivienda Rural",false,null,null,"PND",null,null,"Transversal","XII. Pacto por la equidad de oportunidades para grupos étnicos: Indígenas, Negros, Afrocolombianos, Raizales, Palenqueros y Rrom","B. Capítulo de grupos indígenas","Objetivo 6. Mejorar condiciones físicas y sociales de viviendas y entornos, a través de la implementación de políticas diferenciales, para el mejoramiento de las condiciones de habitabilidad de los hogares con menores ingresos en entornos rurales y urbanas"]
["Documento que sirva de insumo para el Anexo Técnico y que contenga las especificaciones técnicas de las tipologías de vivienda(…)","Vivienda","Aumentar el acceso a vivienda digna","Diseñar e implementar una política de vivienda de interés social rural que responda, de manera eficiente, a las necesidades habitacionales de los hogares que se encuentran en mayor vulnerabilidad socioeconómica","XII. Pacto por la equidad de oportunidades para grupos étnicos: Indígenas, Negros, Afrocolombianos, Raizales, Palenqueros y Rrom","D. Capítulo de comunidades negras, afrocolombianas, raizales y palenqueras","Objetivo 6. Mejorar condiciones físicas y sociales de viviendas y entornos, a través de la implementación de políticas diferenciales, para el mejoramiento de las condiciones de habitabilidad de los hogares con menores ingresos en entornos rurales y urbanas","ODS 11. Ciudades y comunidades sostenibles","-","Dimensión 3. Gestión con Valores para Resultados","Gestión a la Política de Vivienda","Documento que sirva de insumo para el Anexo Técnico y que contenga las especificaciones técnicas de las tipologías de vivienda(…)","Sumatoria de documentos técnicos elaborados","Medir la realización del documento que será construido de acuerdo con la metodología establecida en el Plan Nacional de Construcción y Mejoramiento de Vivienda Social Rural, donde se formulará la estrategia para la concertación de tipologías de vivienda con las comunidades negras, afrocolombianas, raizales y palenqueras.","Variable 1:  Documento que tendrá las especificaciones técnicas de las viviendas concertadas con las comunidades NARP",null,"Suma","NA","Dirección de Vivienda Rural ",30,"Anual","Producto","Número","N/D",0,1,1,0,1,"DVR-Dirección de Vivienda Rural",false,null,null,"PND",null,"PES","Transversal","XII. Pacto por la equidad de oportunidades para grupos étnicos: Indígenas, Negros, Afrocolombianos, Raizales, Palenqueros y Rrom","D. Capítulo de comunidades negras, afrocolombianas, raizales y palenqueras","Objetivo 6. Mejorar condiciones físicas y sociales de viviendas y entornos, a través de la implementación de políticas diferenciales, para el mejoramiento de las condiciones de habitabilidad de los hogares con menores ingresos en entornos rurales y urbanas"]
["Expedición de un instrumento normativo que garantice la focalización y postulación de los hogares pertenecientes a las comunidades indígenas","Vivienda","Aumentar el acceso a vivienda digna","Diseñar e implementar una política de vivienda de interés social rural que responda, de manera eficiente, a las necesidades habitacionales de los hogares que se encuentran en mayor vulnerabilidad socioeconómica","XII. Pacto por la equidad de oportunidades para grupos étnicos: Indígenas, Negros, Afrocolombianos, Raizales, Palenqueros y Rrom","B. Capítulo de grupos indígenas","Objetivo 6. Mejorar condiciones físicas y sociales de viviendas y entornos, a través de la implementación de políticas diferenciales, para el mejoramiento de las condiciones de habitabilidad de los hogares con menores ingresos en entornos rurales y urbanas","ODS 11. Ciudades y comunidades sostenibles","-","Dimensión 3. Gestión con Valores para Resultados","Gestión a la Política de Vivienda","Expedición de un instrumento normativo que garantice la focalización y postulación de los hogares pertenecientes a las comunidades indígenas","Sumatoria de instrumentos normativos expedidos","Medir la expedición del instrumento normativo de focalización y postulación de los hogares pertenecienes a las comunidades indígenas","Variable 1: El instrumento normativo será adoptado mediante resolución en el marco de la política pública de vivienda rural",null,"Suma","NA","Dirección de Vivienda Rural ",30,"Anual","Producto","Número","N/D",0,1,1,0,1,"DVR-Dirección de Vivienda Rural",false,null,null,"PND",null,null,"Transversal","XII. Pacto por la equidad de oportunidades para grupos étnicos: Indígenas, Negros, Afrocolombianos, Raizales, Palenqueros y Rrom","B. Capítulo de grupos indígenas","Objetivo 6. Mejorar condiciones físicas y sociales de viviendas y entornos, a través de la implementación de políticas diferenciales, para el mejoramiento de las condiciones de habitabilidad de los hogares con menores ingresos en entornos rurales y urbanas"]
["Porcentaje de soluciones de vivienda estructuradas y ejecutadas con participación de la comunidad beneficiada","Vivienda","Aumentar el acceso a vivienda digna","Profundizar el acceso a soluciones de vivienda digna a los hogares de menores ingresos.","XI. Pacto por la Construcción de Paz: Cultura de la legalidad, convivencia, estabilización y víctimas","A. Acciones efectivas para la política de estabilización: intervención coordinada en zonas estratégicas con seguridad, justicia y equidad","Objetivo 1. Estabilizar los territorios rurales, principalmente en los 170 municipios PDET","ODS 11. Ciudades y comunidades sostenibles","-","Dimensión 3. Gestión con Valores para Resultados","Gestión a la Política de Vivienda","Porcentaje de soluciones de vivienda estructuradas y ejecutadas con participación de la comunidad beneficiada","(Sumatoria de soluciones de vivienda de interés social rural estructuradas y ejecutadas con participación de la comunidad beneficiada/ Sumatoria total de soluciones de vivienda de interés social rural estructuradas y ejecutadas)*100","Medir el porcentaje de soluciones de viviendas estructuradas y ejecutadas con participación de la comunidad beneficiada en el área rural del territorio nacional. La participación se puede dar de alguna de las siguientes maneras: i) Conformación de veeduría del proyecto  ii) Participación y asistencia a talleres de socialización y construcción de la tipología a implementar. iii) Participación de miembros de la comunidad como mano de obra del proyecto. iv) Contratación por parte del contratista o la interventoría de servicios ofrecidos por miembros de la comunidad o de los beneficiarios del proyecto como acarreos, transporte, alimentación, hospedaje, etc.  v) Asistencia a reuniones de socialización y seguimiento del proyecto con los potenciales beneficiarios. Lo anterior deberá ser certificado por la interventoría o por la veeduría del proyecto a través de actas de los talleres y reuniones con sus respectivos soportes como videos, fotos y listado de asistentes. El indicador busca mantener la relación del número de proyectos que tienen en cuenta a la población beneficiada como parte importante del proyecto y sus alcances, mediante un acompañamiento social que promueva el fomento de actividades y espacios de trabajo en talleres que permitan a la población sentirse parte esencial e identificados con el proyecto y los beneficios propuestos. Su medición es relevante ya que una alta participación minimiza el riesgo de abandono de las viviendas o mejoramientos entregados por no ser relevantes para la población beneficiada o por no generar sentimiento de arraigo y pertenencia.","Variable 1:  Soluciones de vivienda estructuradas y ejecutadas (mejoradas y nuevas entregadas) de aquellos proyectos que hayan cumplido con las condiciones de participación de la comunidad y que haya sido certificado el cumplimiento por parte de la interventoría. La participación de la comunidad en alguna o en varias de  las etapas del proyecto deberá ser certificada por la interventoría o quien designe la entidad para tal fin, mediante el aporte de los soportes de cumplimiento.","Variable 2:  total de soluciones de vivienda estructuradas y ejecutadas (mejoradas y nuevas entregadas en cada vigencia)","Constante","NA","Dirección de Vivienda Rural",30,"Trimestral ","Producto","Porcentaje","N/D",0,0,100,100,100,"DVR-Dirección de Vivienda Rural",false,null,null,"Gestión",null,"PES","Transversal","XI. Pacto por la Construcción de Paz: Cultura de la legalidad, convivencia, estabilización y víctimas","A. Acciones efectivas para la política de estabilización: intervención coordinada en zonas estratégicas con seguridad, justicia y equidad","Objetivo 1. Estabilizar los territorios rurales, principalmente en los 170 municipios PDET"]
["Porcentaje de soluciones de vivienda estructuradas y ejecutadas con participación de la comunidad beneficiada en municipios PDET","Vivienda","Aumentar el acceso a vivienda digna","Profundizar el acceso a soluciones de vivienda digna a los hogares de menores ingresos.","XI. Pacto por la Construcción de Paz: Cultura de la legalidad, convivencia, estabilización y víctimas","A. Acciones efectivas para la política de estabilización: intervención coordinada en zonas estratégicas con seguridad, justicia y equidad","Objetivo 1. Estabilizar los territorios rurales, principalmente en los 170 municipios PDET","ODS 11. Ciudades y comunidades sostenibles","-","Dimensión 3. Gestión con Valores para Resultados","Gestión a la Política de Vivienda","Porcentaje de soluciones de vivienda estructuradas y ejecutadas con participación de la comunidad beneficiada en municipios PDET","Sumatoria de soluciones de vivienda de interés social rural estructuradas y ejecutadas con participación de la comunidad beneficiada en municipios PDET / Total de soluciones de vivienda de interés social rural estructuradas y ejecutadas en municipios PDET)*100","Medir el porcentaje de soluciones de viviendas estructuradas y ejecutadas con participación de la comunidad beneficiada en el área rural del territorio nacional. La participación se puede dar de alguna de las siguientes maneras: i) Conformación de veeduría del proyecto  ii) Participación y asistencia a talleres de socialización y construcción de la tipología a implementar. iii) Participación de miembros de la comunidad como mano de obra del proyecto. iv) Contratación por parte del contratista o la interventoría de servicios ofrecidos por miembros de la comunidad o de los beneficiarios del proyecto como acarreos, transporte, alimentación, hospedaje, etc.  v) Asistencia a reuniones de socialización y seguimiento del proyecto con los potenciales beneficiarios. Lo anterior deberá ser certificado por la interventoría o por la veeduría del proyecto a través de actas de los talleres y reuniones con sus respectivos soportes como videos, fotos y listado de asistentes. El indicador busca mantener la relación del número de proyectos que tienen en cuenta a la población beneficiada como parte importante del proyecto y sus alcances, mediante un acompañamiento social que promueva el fomento de actividades y espacios de trabajo en talleres que permitan a la población sentirse parte esencial e identificados con el proyecto y los beneficios propuestos. Su medición es relevante ya que una alta participación minimiza el riesgo de abandono de las viviendas o mejoramientos entregados por no ser relevantes para la población beneficiada o por no generar sentimiento de arraigo y pertenencia.","Variable 1:   Soluciones de vivienda estructuradas y ejecutadas (mejoradas y nuevas entregadas) de aquellos proyectos en municipios PDETque hayan cumplido con las condiciones de participación de la comunidad y que haya sido certificado el cumplimiento por parte de la interventoría. La participación de la comunidad en alguna o en varias de  las etapas del proyecto deberá ser certificada por la interventoría, veeduría o quien designe la entidad para tal fin, mediante el aporte de los soportes de cumplimiento.","Variable 2:  total de soluciones de vivienda estructuradas y ejecutadas (mejoradas y nuevas entregadas en cada vigencia) en municipios PDET","Constante","NA","Dirección de Vivienda Rural",30,"Trimestral ","Producto","Porcentaje","N/D",0,0,100,100,100,"DVR-Dirección de Vivienda Rural",false,{"$f":"AE86/Y86","v":{"$error":"#DIV/0!"}},null,"Gestión",180,null,"Transversal","XI. Pacto por la Construcción de Paz: Cultura de la legalidad, convivencia, estabilización y víctimas","A. Acciones efectivas para la política de estabilización: intervención coordinada en zonas estratégicas con seguridad, justicia y equidad","Objetivo 1. Estabilizar los territorios rurales, principalmente en los 170 municipios PDET","ODS 16. Paz, justicia e instituciones sólidas","NO"]
["Elaboración de los instrumentos Archivísticos del MVCT","Institucional","Robustecer la capacidad de gestión y desempeño de las entidades del sector","Mejorar las políticas de gestión y desempeño","I. Pacto por la legalidad: seguridad efectiva y justicia transparente para que todos vivamos con libertad y en democracia","C. Alianza contra la corrupción: tolerancia cero con los corruptos","Objetivo 1. Pacto de cero tolerancia a la corrupción y a la falta de transparencia","ODS 16. Paz, justicia e instituciones sólidas","-","Dimensión 3. Gestión con Valores para Resultados","Gestión Documental","Elaboración de los instrumentos Archivísticos del MVCT","Número de instrumentos archivísticos elaborados y entregados para aprobacion ","Elaborar los instrumentos archivísticos del MVCT teniendo en cuenta lo estipulado en el decreto 1080 del 2015 y la ley 594 del 2000","Variable 1 Instrumentos archivísticos elaborados: Número de instrumentos archivísticos elaborados y entregados para aprobación",null,"Decreciente ","2019-12-31","Diagnóstico Integral de Archivos ",0,"Trimestral","Eficacia ","Número","N/D",3,2,1,1,7,"GAUA-Grupo de Atención al Usuario y Archivo",false,{"$f":"AE87/Y87","v":0},null,"Gestión",180,null,"Transversal","I. Pacto por la legalidad: seguridad efectiva y justicia transparente para que todos vivamos con libertad y en democracia","C. Alianza contra la corrupción: tolerancia cero con los corruptos","Objetivo 1. Pacto de cero tolerancia a la corrupción y a la falta de transparencia","ODS 16. Paz, justicia e instituciones sólidas","NO"]
["Número de reportes de  informacion gestionada y tramitada","Institucional","Robustecer la capacidad de gestión y desempeño de las entidades del sector","Mejorar las políticas de gestión y desempeño","I. Pacto por la legalidad: seguridad efectiva y justicia transparente para que todos vivamos con libertad y en democracia","C. Alianza contra la corrupción: tolerancia cero con los corruptos","Objetivo 1. Pacto de cero tolerancia a la corrupción y a la falta de transparencia","ODS 16. Paz, justicia e instituciones sólidas","-","Dimensión 3. Gestión con Valores para Resultados","Gestión Documental","Número de reportes de  informacion gestionada y tramitada","Número de reportes realizados","Determinar la ejecución de los canales de atención del Ministerio vivienda ciudad y territorio","Variable 1 Reportes realizados: son los reportes de gestión mensual de los canales de atención y los documentos tramitados a través de la herramienta de gestión documental",null,"Suma ","2019-12-31","Base de datos de la Herramienta de Gestión Documental, base de datos del Digiturno de la sede Cll 18 y reportes aportados por el centro de contacto del Ministerio de vivienda, Ciudad y Territorio",0,"Mensual","Eficacia ","Número","N/D",0,12,12,12,36,"GAUA-Grupo de Atención al Usuario y Archivo",false,null,null,"Gestión",180,null,"Transversal","I. Pacto por la legalidad: seguridad efectiva y justicia transparente para que todos vivamos con libertad y en democracia","C. Alianza contra la corrupción: tolerancia cero con los corruptos","Objetivo 1. Pacto de cero tolerancia a la corrupción y a la falta de transparencia","ODS 11. Ciudades y comunidades sostenibles","NO"]
["Satisfacción del peticionario con relación a la respuesta recibida por parte del MVCT","Institucional","Robustecer la capacidad de gestión y desempeño de las entidades del sector","Fortalecer los estándares de transparencia y diálogo con la ciudadanía y los grupos de valor","I. Pacto por la legalidad: seguridad efectiva y justicia transparente para que todos vivamos con libertad y en democracia","C. Alianza contra la corrupción: tolerancia cero con los corruptos","Objetivo 1. Pacto de cero tolerancia a la corrupción y a la falta de transparencia","ODS 16. Paz, justicia e instituciones sólidas","-","Dimensión 3. Gestión con Valores para Resultados","Servicio al Ciudadano","Satisfacción del peticionario con relación a la respuesta recibida por parte del MVCT","(Número de peticionarios satisfechos con respuesta emitida/Número total de peticionarios contactados telefonicamente y que responden la encuesta)*100","Determinar el porcentaje de satisfacción del usuario en la atención de las PQRSDF direccionadas al Grupo Servicio al Ciudadano del Ministerio vivienda ciudad y territorio.","Variable 1  Son los usuarios que obtuvieron una atención adecuada a su PQRSDF tramitada ante el grupo Servicio al Ciudadano","Variable 2 Peticionarios contactados: Son todos los usuarios contactados telefónica que obtuvieron respuesta a la solicitud interpuesta ante el grupo Servicio al Ciudadano del Ministerio de vivienda, Ciudad y Territorio.","Creciente","2019-12-31","Encuesta diligenciada y remitida en formato Excel por el centro de contacto del Ministerio de Vivienda, Ciudad y Territorio",0,"Semestral","Eficacia","Porcentaje","N/D",0,86,88,90,90,"GAUA-Grupo de Atención al Usuario y Archivo",false,{"$f":"AE89/Y89","v":{"$error":"#DIV/0!"}},null,"Gestión",180,null,"Transversal","I. Pacto por la legalidad: seguridad efectiva y justicia transparente para que todos vivamos con libertad y en democracia","C. Alianza contra la corrupción: tolerancia cero con los corruptos","Objetivo 1. Pacto de cero tolerancia a la corrupción y a la falta de transparencia","ODS 6. Agua limpia y saneamiento","NO"]
["Satisfacción del usuario atendido de forma personalizada","Institucional","Robustecer la capacidad de gestión y desempeño de las entidades del sector","Fortalecer los estándares de transparencia y diálogo con la ciudadanía y los grupos de valor","I. Pacto por la legalidad: seguridad efectiva y justicia transparente para que todos vivamos con libertad y en democracia","C. Alianza contra la corrupción: tolerancia cero con los corruptos","Objetivo 1. Pacto de cero tolerancia a la corrupción y a la falta de transparencia","ODS 16. Paz, justicia e instituciones sólidas","-","Dimensión 3. Gestión con Valores para Resultados","Servicio al Ciudadano","Satisfacción del usuario atendido de forma personalizada","(Número de Usuarios satisfechos/Número total de usuarios que diligenciaron la encuesta)*100","Determinar el porcentaje de satisfacción del usuario en la atención personalizada, telefonica y virtual del Ministerio vivienda ciudad y territorio.","Variable 1 Usuarios satisfechos: Son los usuarios que obtuvieron una atención adecuada a su consulta personalizada tanto en la atención presencial como en la telefónica o virtual.","Variable 2 Usuarios que diligenciaron la encuesta: son todos los usuarios que diligenciaron la encuesta presencial, telefónica o virtual","Creciente","2019-12-31","Formato AUL-F-12 Encuesta de Satisfacción al Usuario, Encuesta chat virtual y estadística de la satisfacción del canal telefónico aportado por el centro de contacto",0,"Mensual","Eficacia","Porcentaje","N/D",0,90,93,95,95,"GAUA-Grupo de Atención al Usuario y Archivo",false,{"$f":"AE90/Y90","v":{"$error":"#DIV/0!"}},null,"Gestión",180,null,"Transversal","I. Pacto por la legalidad: seguridad efectiva y justicia transparente para que todos vivamos con libertad y en democracia","C. Alianza contra la corrupción: tolerancia cero con los corruptos","Objetivo 1. Pacto de cero tolerancia a la corrupción y a la falta de transparencia","ODS 6. Agua limpia y saneamiento","NO"]
["Evaluación de la comunicación interna","Institucional","Robustecer la capacidad de gestión y desempeño de las entidades del sector","Mejorar las políticas de gestión y desempeño","I. Pacto por la legalidad: seguridad efectiva y justicia transparente para que todos vivamos con libertad y en democracia","C. Alianza contra la corrupción: tolerancia cero con los corruptos","Objetivo 1. Pacto de cero tolerancia a la corrupción y a la falta de transparencia","ODS 16. Paz, justicia e instituciones sólidas","-","Dimensión 5.  Información y Comunicación ","Gestión de Comunicaciones Internas y Externas","Evaluación de la comunicación interna","Promedio de las valorizaciones de los productos comunicacionales por parte de las dependencias del Ministerio de Vivienda, Ciudad y Territorio","Medir la satisfacción de los productos de comunicación interna solicitados por las diferentes dependencias de la Entidad","Variable 1 Valorizaciones de los productos comunicacionales: corresponde al promedio de calificaciones mensuales asignadas por las dependencias a los productos de comunicación interna realizados por el GCE",null,"Creciente","2019-12-31","Informe de la actividad de sensibilización con evidencias de las actividades realizadas",5,"Mensual ","Calidad","Porcentaje","N/D",0,68,75,80,80,"GCE-Grupo de Comunicaciones Estratégicas",false,{"$f":"AE91/Y91","v":{"$error":"#DIV/0!"}},null,"Gestión",180,null,"Transversal","I. Pacto por la legalidad: seguridad efectiva y justicia transparente para que todos vivamos con libertad y en democracia","C. Alianza contra la corrupción: tolerancia cero con los corruptos","Objetivo 1. Pacto de cero tolerancia a la corrupción y a la falta de transparencia","ODS 6. Agua limpia y saneamiento","NO"]
["Porcentaje de noticias positivas relacionadas con el sector publicadas en medios de comunicación","Institucional","Robustecer la capacidad de gestión y desempeño de las entidades del sector","Fortalecer los estándares de transparencia y diálogo con la ciudadanía y los grupos de valor","I. Pacto por la legalidad: seguridad efectiva y justicia transparente para que todos vivamos con libertad y en democracia","C. Alianza contra la corrupción: tolerancia cero con los corruptos","Objetivo 1. Pacto de cero tolerancia a la corrupción y a la falta de transparencia","ODS 16. Paz, justicia e instituciones sólidas","-","Dimensión 5.  Información y Comunicación ","Gestión de Comunicaciones Internas y Externas","Porcentaje de noticias positivas relacionadas con el sector publicadas en medios de comunicación","(Sumatoria de noticias positivas relacionadas con el sector publicadas en medios de comunicación / Número total de noticias relacionadas con el sector publicadas en medios de comunicación)*100","Medir el porcentaje de noticias positivas que se publican en los medios de comunicación sobre la gestión del Ministerio y el cual resume las actividades de comunicación externa y periodísticas de la Entidad.","Variable 1 Noticias positivas relacionadas con el sector: corresponde a la sumatoria de noticias positivas relacionadas con el sector publicadas en medios de comunicación","Variable 2 Noticias relacionadas con el sector: corresponde al número total de noticias relacionadas con el sector publicadas en medios de comunicación","Creciente","2018-12-31","Reporte de noticias diarias publicadas en medios de comunicación",10,"Mensual ","Calidad","Porcentaje",80,80,85,88,90,90,"GCE-Grupo de Comunicaciones Estratégicas",false,null,null,"Gestión",180,"PES","Transversal","I. Pacto por la legalidad: seguridad efectiva y justicia transparente para que todos vivamos con libertad y en democracia","C. Alianza contra la corrupción: tolerancia cero con los corruptos","Objetivo 1. Pacto de cero tolerancia a la corrupción y a la falta de transparencia","ODS 11. Ciudades y comunidades sostenibles","NO"]
["Eficiencia en el tiempo de revisión de los procesos contractuales por parte del Grupo de Contratos","Institucional","Robustecer la capacidad de gestión y desempeño de las entidades del sector","Mejorar las políticas de gestión y desempeño","XV. Pacto por una gestión pública efectiva","B. Gasto público efectivo","Objetivo 2. Simplificar y optimizar la contratación pública ","ODS 16. Paz, justicia e instituciones sólidas","-","Dimensión 3. Gestión con Valores para Resultados","Gestión de Contratación","Eficiencia en el tiempo de revisión de los procesos contractuales por parte del Grupo de Contratos","Sumatoria de días en revisión de los tipos de contratación adelantados durante el periodo evaluado  /Número de tipos de contratación adelantados durante el periodo evaluado","Medir los tiempos de respuesta ante las solicitudes de las diferentes dependencias atendidas por el Grupo de Contratos.","Variable 1: Sumatoria de días en revisión de los tipos de contratación adelantados durante el periodo evaluado: Corresponde al resultado de la suma de los promedios de días de revisión de documentos, para cada modalidad de contratación.","Variable 2: Número de tipos de contratación adelantados durante el periodo evaluado: Corresponde a la cantidad de modalidades de contratación que se utilizaron durante el periodo evaluado.","Decreciente","2020-12-31","Cuadro Seguimiento de procesos ","NA","Semestral","Eficiencia","Número","N/D",0,0,5,4,4,"GC-Grupo de Contratos ",false,null,null,"Gestión",180,"PES","Transversal","XV. Pacto por una gestión pública efectiva","B. Gasto público efectivo","Objetivo 2. Simplificar y optimizar la contratación pública ","ODS 12. Producción y consumo responsables","NO"]
["Actividades de prevención desarrolladas durante el año ","Institucional","Robustecer la capacidad de gestión y desempeño de las entidades del sector","Mejorar las políticas de gestión y desempeño","I. Pacto por la legalidad: seguridad efectiva y justicia transparente para que todos vivamos con libertad y en democracia","C. Alianza contra la corrupción: tolerancia cero con los corruptos","Objetivo 1. Pacto de cero tolerancia a la corrupción y a la falta de transparencia","ODS 16. Paz, justicia e instituciones sólidas","-","Dimensión 1. Talento Humano","Procesos Disciplinarios","Actividades de prevención desarrolladas durante el año ","Número de actividades de prevención realizadas durante la vigencia ","Medir el número de actividades realizadas para prevenir la ocurrencia de faltas disciplinarias","Variable 1 Actividades de prevención: corresponde a aquellas actividades que realiza el Grupo de Control Interno Disciplinario a los funcionarios del MVCT para prevenir la ocurrencia de posibles faltas disciplinarias ",null,"Suma","2019-12-31","Grupo de Control Interno Disciplinario (GCID)",0,"Bimensual","Eficacia","Número",0,0,4,5,5,14,"GCID-Grupo de Control Interno Disciplinario ",false,null,null,"Gestión",365,"PES","Transversal","I. Pacto por la legalidad: seguridad efectiva y justicia transparente para que todos vivamos con libertad y en democracia","C. Alianza contra la corrupción: tolerancia cero con los corruptos","Objetivo 1. Pacto de cero tolerancia a la corrupción y a la falta de transparencia","ODS 6. Agua limpia y saneamiento","NO"]
["Porcentaje de procesos aperturados en el mes","Institucional","Robustecer la capacidad de gestión y desempeño de las entidades del sector","Mejorar las políticas de gestión y desempeño","I. Pacto por la legalidad: seguridad efectiva y justicia transparente para que todos vivamos con libertad y en democracia","C. Alianza contra la corrupción: tolerancia cero con los corruptos","Objetivo 1. Pacto de cero tolerancia a la corrupción y a la falta de transparencia","ODS 16. Paz, justicia e instituciones sólidas","-","Dimensión 1. Talento Humano","Procesos Disciplinarios","Porcentaje de procesos aperturados en el mes","(Número de procesos aperturados/Número de quejas recibidas que requieren apertura de proceso)*100","Medir la proporcion de procesos disciplinarios aperturados a partir de las quejas recibidas","Variable 1 Procesos aperturados: Corresponde al número de procesos aperturados en el mes","Variable 2 Quejas recibidas: Corresponde al número de quejas recibidas para evaluar la pertinencia del inicio de un proceso disciplinario","Constante","2018-12-31","Grupo de Control Interno Disciplinario (GCID)",0,"Mensual ","Eficacia","Porcentaje",100,100,100,100,100,100,"GCID-Grupo de Control Interno Disciplinario ",false,null,null,"Gestión",30,"PES","Transversal","I. Pacto por la legalidad: seguridad efectiva y justicia transparente para que todos vivamos con libertad y en democracia","C. Alianza contra la corrupción: tolerancia cero con los corruptos","Objetivo 1. Pacto de cero tolerancia a la corrupción y a la falta de transparencia","ODS 11. Ciudades y comunidades sostenibles","NO"]
["Diagnóstico de la infraestructura de las Sedes del Ministerio de Vivienda, Ciudad y Territorio realizado","Institucional","Robustecer la capacidad de gestión y desempeño de las entidades del sector","Mejorar las políticas de gestión y desempeño","XV. Pacto por una gestión pública efectiva","B. Gasto público efectivo","Objetivo 3. Optimizar la administración del patrimonio del Estado y la gestión de activos \n","ODS 16. Paz, justicia e instituciones sólidas","-","Dimensión 3. Gestión con Valores para Resultados","Gestión de Recursos Físicos","Diagnóstico de la infraestructura de las Sedes del Ministerio de Vivienda, Ciudad y Territorio realizado","Sumatoria de diagnósticos realizados","Medir el estado actual y real de la infraestructura de las diferentes sedes del MVCT, con el fin de definir las actividades de mantenimiento y mejoras a realizar en éstas","Variable 1 Diagnósticos realizados: Documento diagnóstico realizado y aprobado",null,"Suma","2019-12-31","Grupo de Recursos Físicos (GRF)",0,"Anual","Producto","Número",0,0,1,1,1,3,"GRF-Grupo de Recursos Físicos",false,null,null,"Gestión",null,"PES","Transversal","XV. Pacto por una gestión pública efectiva","B. Gasto público efectivo","Objetivo 3. Optimizar la administración del patrimonio del Estado y la gestión de activos \n"]
["Porcentaje de avance en la solución integral a la ubicación de las sedes del MVCT","Institucional","Robustecer la capacidad de gestión y desempeño de las entidades del sector","Mejorar las políticas de gestión y desempeño","XV. Pacto por una gestión pública efectiva","B. Gasto público efectivo","Objetivo 3. Optimizar la administración del patrimonio del Estado y la gestión de activos","ODS 16. Paz, justicia e instituciones sólidas","-","Dimensión 3. Gestión con Valores para Resultados","Gestión de Recursos Físicos","Porcentaje de avance en la solución integral a la ubicación de las sedes del MVCT","(Número de actividades ejecutadas para dar solución integral a la ubicación de las sedes del MVCT / Número de actividades programadas para dar solución integral a la ubicación de las sedes del MVCT)*100","Medir la eficacia en la ejecución de las adecuaciones necesarias para dar la solución integral  a la ubicación de las sedes del ministerio.","Variable 1 Servicios atendidos: Actividades realizadas que muestran el avance en la solución integral a la ubicación de las sedes del Ministerio. ","Variable 2 Servicios requeridos: Actividades programadas que muestran el avance en la solución integral a la ubicación de las sedes del Ministerio.","Creciente ","2019-12-31","Grupo de Recursos Físicos (GRF)",0,"Trimestral","Eficacia ","Porcentaje","N/D",0,20,30,50,50,"GRF-Grupo de Recursos Físicos",false,null,null,"Gestión",null,null,"Transversal","XV. Pacto por una gestión pública efectiva","B. Gasto público efectivo","Objetivo 3. Optimizar la administración del patrimonio del Estado y la gestión de activos"]
["Porcentaje de mantenimientos preventivos realizados a los bienes muebles e inmuebles del Ministerio","Institucional","Robustecer la capacidad de gestión y desempeño de las entidades del sector","Mejorar las políticas de gestión y desempeño","XV. Pacto por una gestión pública efectiva","B. Gasto público efectivo","Objetivo 3. Optimizar la administración del patrimonio del Estado y la gestión de activos","ODS 16. Paz, justicia e instituciones sólidas","-","Dimensión 3. Gestión con Valores para Resultados","Gestión de Recursos Físicos","Porcentaje de mantenimientos preventivos realizados a los bienes muebles e inmuebles del Ministerio","(No. de mantenimientos preventivos realizados / No. de mantenimientos preventivos programados)*100 ","Medir la eficacia en la ejecución de los mantenimientos a los bienes muebles e inmuebles del Ministerio de acuerdo con las necesidades previstas.","Variable 1 Servicios atendidos: Corresponde al número de mantenimientos preventivos efectivamente realizados en el mes","Variable 2 Servicios requeridos: Corresponde al número de mantenimientos preventivos programados de acuerdo a las necesidades de las diferentes sedes del MVCT.","Constante","2020-12-31","Grupo de Recursos Físicos (GRF)",0,"Mensual","Eficacia ","Porcentaje","N/D",0,0,90,90,90,"GRF-Grupo de Recursos Físicos",false,null,null,"Gestión",null,null,"Transversal","XV. Pacto por una gestión pública efectiva","B. Gasto público efectivo","Objetivo 3. Optimizar la administración del patrimonio del Estado y la gestión de activos"]
["Porcentaje de servicios atendidos solicitados por las dependencias del MVCT al Grupo de Recursos Físicos","Institucional","Robustecer la capacidad de gestión y desempeño de las entidades del sector","Mejorar las políticas de gestión y desempeño","XV. Pacto por una gestión pública efectiva","B. Gasto público efectivo","Objetivo 3. Optimizar la administración del patrimonio del Estado y la gestión de activos \n","ODS 16. Paz, justicia e instituciones sólidas","-","Dimensión 3. Gestión con Valores para Resultados","Gestión de Recursos Físicos","Porcentaje de servicios atendidos solicitados por las dependencias del MVCT al Grupo de Recursos Físicos","(Servicios Atendidos solicitados por las dependencias/Servicios Requeridos por las dependecias)*100","Medir el cumplimiento en la prestación de los servicios solicitados al Grupo de Recursos Físicos por las diferentes dependencias del MVCT con el fin de establecer la eficacia del mismo","Variable 1 Servicios atendidos: número de servicios prestados a las dependencias del MVCT","Variable 2 Servicios requeridos: número de servicios solicitados por las dependencias del MVCT a realizar por el GRF","Creciente ","2019-12-31","Grupo de Recursos Físicos (GRF)",0,"Mensual","Eficacia","Porcentaje",0,0,90,95,100,100,"GRF-Grupo de Recursos Físicos",false,null,null,"Gestión",null,null,"Transversal","XV. Pacto por una gestión pública efectiva","B. Gasto público efectivo","Objetivo 3. Optimizar la administración del patrimonio del Estado y la gestión de activos \n"]
["Avance del Plan Anual de Empleos Vacantes","Institucional","Robustecer la capacidad de gestión y desempeño de las entidades del sector","Mejorar las políticas de gestión y desempeño","XV. Pacto por una gestión pública efectiva","A. Transformación de la administración\nPública","Objetivo 1. Evaluar la arquitectura institucional del Gobierno con el fin de redefinir misiones, roles y competencias que permitan el funcionamiento eficiente del Estado en los diferentes niveles de gobierno","ODS 16. Paz, justicia e instituciones sólidas","-","Dimensión 1. Talento Humano","Gestión Estratégica de Talento Humano","Avance del Plan Anual de Empleos Vacantes","(Actividades ejecutadas en el Plan Anual de Empleos Vacantes/Actividades programadas)*100","Medir el cumplimiento de las actividades programadas en el plan de empleos vacantes del Ministerio de Vivienda, Ciudad y Territorio de la vigencia en curso","Variable 1 Actividades ejecutadas en el Plan Anual de Empleos Vacantes: corresponde al total de actividades que va desarrollando el Grupo de Talento Humano durante la vigencia en curso, en el marco del plan de empleos vacantes ","Variable 2 Actividades programadas: corresponde al total de actividades programadas por el Grupo de Talento Humano en el plan de empleos vacantes para la vigencia en curso","Suma","2018-12-31","Grupo de Talento Humano (GTH)","N/A","Semestral","Eficacia","Porcentaje",100,0,100,100,0,100,"GTH-Grupo de Talento Humano",false,null,null,"Gestión",null,null,"Estructural ","XV. Pacto por una gestión pública efectiva","A. Transformación de la administración\nPública","Objetivo 1. Evaluar la arquitectura institucional del Gobierno con el fin de redefinir misiones, roles y competencias que permitan el funcionamiento eficiente del Estado en los diferentes niveles de gobierno"]
["Avance del Plan Anual de Seguridad y Salud en el Trabajo","Institucional","Robustecer la capacidad de gestión y desempeño de las entidades del sector","Mejorar las políticas de gestión y desempeño","XV. Pacto por una gestión pública efectiva","A. Transformación de la administración\nPública","Objetivo 1. Evaluar la arquitectura institucional del Gobierno con el fin de redefinir misiones, roles y competencias que permitan el funcionamiento eficiente del Estado en los diferentes niveles de gobierno","ODS 16. Paz, justicia e instituciones sólidas","-","Dimensión 1. Talento Humano","Gestión Estratégica de Talento Humano","Avance del Plan Anual de Seguridad y Salud en el Trabajo","(Actividades ejecutadas del Plan anual de Seguridad y Salud en el Trabajo/Actividades programadas)*100","Medir el cumplimiento de las actividades programadas en el Plan de Seguridad y Salud en el Trabajo del Ministerio de Vivienda, Ciudad y Territorio de la vigencia en curso","Variable 1: Actividades ejecutadas del Plan anual de Seguridad y Salud en el Trabajo","Variable 2: Actividades programadas","Suma","2018-12-31","Grupo de Talento Humano (GTH)","N/A","Trimestral","Eficacia","Porcentaje",100,0,100,100,100,100,"GTH-Grupo de Talento Humano",false,null,null,"Gestión",null,null,"Estructural ","XV. Pacto por una gestión pública efectiva","A. Transformación de la administración\nPública","Objetivo 1. Evaluar la arquitectura institucional del Gobierno con el fin de redefinir misiones, roles y competencias que permitan el funcionamiento eficiente del Estado en los diferentes niveles de gobierno"]
["Avance del Plan de Previsión","Institucional","Robustecer la capacidad de gestión y desempeño de las entidades del sector","Mejorar las políticas de gestión y desempeño","XV. Pacto por una gestión pública efectiva","A. Transformación de la administración\nPública","Objetivo 1. Evaluar la arquitectura institucional del Gobierno con el fin de redefinir misiones, roles y competencias que permitan el funcionamiento eficiente del Estado en los diferentes niveles de gobierno","ODS 16. Paz, justicia e instituciones sólidas","-","Dimensión 1. Talento Humano","Gestión Estratégica de Talento Humano","Avance del Plan de Previsión","(Actividades ejecutadas del Plan de previsión/Actividades programadas)*100","Medir el cumplimiento de las actividades programadas en el plan de previsión del Ministerio de Vivienda, Ciudad y Territorio de la vigencia en curso","Variable 1 Actividades ejecutadas del Plan de previsión: corresponde al total de actividades que va desarrollando el Grupo de Talento Humano durante la vigencia en curso, en el marco del plan de previsión ","Variable 2 Actividades programadas: corresponde al total de actividades programadas por el Grupo de Talento Humano en el plan de previsión para la vigencia en curso","Suma","2018-12-31","Grupo de Talento Humano (GTH)","N/A","Anual","Eficacia","Porcentaje",100,0,100,100,100,100,"GTH-Grupo de Talento Humano",false,null,null,"Gestión",null,null,"Estructural ","XV. Pacto por una gestión pública efectiva","A. Transformación de la administración\nPública","Objetivo 1. Evaluar la arquitectura institucional del Gobierno con el fin de redefinir misiones, roles y competencias que permitan el funcionamiento eficiente del Estado en los diferentes niveles de gobierno"]
["Avance del Plan Institucional de Capacitación","Institucional","Robustecer la capacidad de gestión y desempeño de las entidades del sector","Mejorar las políticas de gestión y desempeño","XV. Pacto por una gestión pública efectiva","A. Transformación de la administración\nPública","Objetivo 1. Evaluar la arquitectura institucional del Gobierno con el fin de redefinir misiones, roles y competencias que permitan el funcionamiento eficiente del Estado en los diferentes niveles de gobierno","ODS 16. Paz, justicia e instituciones sólidas","-","Dimensión 1. Talento Humano","Gestión Estratégica de Talento Humano","Avance del Plan Institucional de Capacitación","(Actividades ejecutadas en el plan institucional de capacitación/Actividades programadas)*100","Medir el cumplimiento de las actividades programadas en el plan institucional de capacitación del Ministerio de Vivienda, Ciudad y Territorio de la vigencia en curso","Variable 1 Actividades ejecutadas del plan institucional de capacitación: corresponde al total de actividades que va desarrollando el Grupo de Talento Humano durante la vigencia en curso, en el marco del plan institucional de capacitación","Variable 2 Actividades programadas: corresponde al total de actividades programadas por el Grupo de Talento Humano en el plan institucional de capacitación para la vigencia en curso","Suma ","2018-12-31","Grupo de Talento Humano (GTH)","N/A","Semestral","Eficacia","Porcentaje",100,0,100,100,100,100,"GTH-Grupo de Talento Humano",false,null,null,"Gestión",null,null,"Estructural ","XV. Pacto por una gestión pública efectiva","A. Transformación de la administración\nPública","Objetivo 1. Evaluar la arquitectura institucional del Gobierno con el fin de redefinir misiones, roles y competencias que permitan el funcionamiento eficiente del Estado en los diferentes niveles de gobierno"]
["Avance del Programa de Bienestar Social e Incentivos","Institucional","Robustecer la capacidad de gestión y desempeño de las entidades del sector","Mejorar las políticas de gestión y desempeño","XV. Pacto por una gestión pública efectiva","A. Transformación de la administración\nPública","Objetivo 1. Evaluar la arquitectura institucional del Gobierno con el fin de redefinir misiones, roles y competencias que permitan el funcionamiento eficiente del Estado en los diferentes niveles de gobierno","ODS 16. Paz, justicia e instituciones sólidas","-","Dimensión 1. Talento Humano","Gestión Estratégica de Talento Humano","Avance del Programa de Bienestar Social e Incentivos","(Actividades ejecutadas del programa de bienestar social e incentivos/Actividades programadas)*100","Medir el cumplimiento de las actividades establecidas en el programa de bienestar social e incentivos del Ministerio de Vivienda, Ciudad y Territorio de la vigencia en curso","Variable 1 Actividades ejecutadas del programa de bienestar social e incentivos: corresponde al total de actividades que va desarrollando el Grupo de Talento Humano durante la vigencia en curso, en el marco del programa de bienestar social e incentivos","Variable 2 Actividades programadas: corresponde al total de actividades programadas por el Grupo de Talento Humano en el programa de bienestar social e incentivos para la vigencia en curso","Suma","2018-12-31","Grupo de Talento Humano (GTH)","NA","Trimestral ","Eficacia","Porcentaje",100,0,100,100,100,100,"GTH-Grupo de Talento Humano",false,null,null,"Gestión",null,null,"Estructural ","XV. Pacto por una gestión pública efectiva","A. Transformación de la administración\nPública","Objetivo 1. Evaluar la arquitectura institucional del Gobierno con el fin de redefinir misiones, roles y competencias que permitan el funcionamiento eficiente del Estado en los diferentes niveles de gobierno"]
["Crecimiento del puntaje asignado a la dimensión de Talento humano (TH) a partir del FURAG","Institucional","Robustecer la capacidad de gestión y desempeño de las entidades del sector","Mejorar las políticas de gestión y desempeño","XV. Pacto por una gestión pública efectiva","A. Transformación de la administración\nPública","Objetivo 1. Evaluar la arquitectura institucional del Gobierno con el fin de redefinir misiones, roles y competencias que permitan el funcionamiento eficiente del Estado en los diferentes niveles de gobierno","ODS 16. Paz, justicia e instituciones sólidas","-","Dimensión 1. Talento Humano","Gestión Estratégica de Talento Humano","Crecimiento del puntaje asignado a la dimensión de Talento humano (TH) a partir del FURAG","Puntaje Dimensión TH del año (t) - Puntaje Dimensión TH del año (t-1)","Medir el avance en la implementación de la política de Talento humano (TH) del Modelo Integrado de Planeación y Gestión (MIPG) en el ministerio a partir del Formulario Único de Registro de Avances de Gestión (FURAG)","Variable 1Puntaje Política de Planeación Institucional del año (t): corresponde al puntaje obtenido por el ministerio en el Informe de Gestión y Desempeño Institucional del Departamento Administrativo de la Función Pública (DAFP), en el año objeto de medición de la política de Talento humano (TH)","Variable 2 Puntaje Política de Planeación Institucional del año (t-1): corresponde al puntaje obtenido por el ministerio en el Informe de Gestión y Desempeño Institucional del Departamento Administrativo de la Función Pública (DAFP), en el año anterior al periodo objeto de medición deTalento humano (TH)","Creciente","2018-12-31","Grupo de Talento Humano (GTH)","N/A","Anual ","Eficacia ","Número",65.900000000000006,2,2,3,3,10,"GTH-Grupo de Talento Humano",false,null,null,"Gestión",180,null,"Estructural ","XV. Pacto por una gestión pública efectiva","A. Transformación de la administración\nPública","Objetivo 1. Evaluar la arquitectura institucional del Gobierno con el fin de redefinir misiones, roles y competencias que permitan el funcionamiento eficiente del Estado en los diferentes niveles de gobierno"]
["Porcentaje  de fallos  de tutela favorables de vivienda urbana","Institucional","Robustecer la capacidad de gestión y desempeño de las entidades del sector","Promover la implementación de la gestión del conocimiento e innovación en el ministerio","I. Pacto por la legalidad: seguridad efectiva y justicia transparente para que todos vivamos con libertad y en democracia","B. Imperio de la ley: derechos humanos, justicia accesible, oportuna y en toda Colombia, para todos","Objetivo 5. Defensa jurídica del Estado ","ODS 16. Paz, justicia e instituciones sólidas","-","Dimensión 3. Gestión con Valores para Resultados","Procesos Judiciales y Acciones Constitucionales","Porcentaje  de fallos  de tutela favorables de vivienda urbana","(Número de fallos favorables/Número total de fallos)*100","Realizar seguimiento a las decisiones emitidas por el comité de conciliación y la celebración de las audiencias conforme a los conceptos del mismo","Variable 1 Actas de audiencias entregadas por apoderado: corresponden al registro de lo ocurrido en la audiencia celebrada en un despacho judicial","Variable 2 Casos decididos por el comité: corresponde a los asuntos sometidos a comité de conciliación y de los cuales se emite concepto por parte del mismo","Creciente","2019-12-31","Actas del Comité de Conciliacion","NA","Trimestral","Eficacia","Porcentaje",50,0,53,56,59,59,"OAJ-Oficina Asesora Jurídica",false,null,null,"Gestión",180,null,"Transversal","I. Pacto por la legalidad: seguridad efectiva y justicia transparente para que todos vivamos con libertad y en democracia","B. Imperio de la ley: derechos humanos, justicia accesible, oportuna y en toda Colombia, para todos","Objetivo 5. Defensa jurídica del Estado "]
["Porcentaje de actas de audiencias entregadas por apoderado","Institucional","Robustecer la capacidad de gestión y desempeño de las entidades del sector","Mejorar las políticas de gestión y desempeño","I. Pacto por la legalidad: seguridad efectiva y justicia transparente para que todos vivamos con libertad y en democracia","B. Imperio de la ley: derechos humanos, justicia accesible, oportuna y en toda Colombia, para todos","Objetivo 5. Defensa jurídica del Estado ","ODS 16. Paz, justicia e instituciones sólidas","-","Dimensión 3. Gestión con Valores para Resultados","Procesos Judiciales y Acciones Constitucionales","Porcentaje de actas de audiencias entregadas por apoderado","(Actas de audiencias entregadas por apoderado/Número de casos decididos por el comité)*100","Determinar la efectividad de la defensa judicial ejercida por parte de la OAJ, al impedir fallos adversos a la entidad","Variable 1 Fallos favorables: cantidad de fallos a favor de los argumenos jurídicos emitidos por la entidad en la contestación de las tutelas","Variable 2 Total de fallos: cantidad de fallos tanto positivos como negativos emitidos por los despachos judiciales","Creciente","2019-12-31","Reporte mensual de comparativo de tutelas en el PEI",null,"Trimestral","Eficacia","Porcentaje",0,0,60,62,64,64,"OAJ-Oficina Asesora Jurídica",false,null,null,"Gestión",180,null,"Transversal","I. Pacto por la legalidad: seguridad efectiva y justicia transparente para que todos vivamos con libertad y en democracia","B. Imperio de la ley: derechos humanos, justicia accesible, oportuna y en toda Colombia, para todos","Objetivo 5. Defensa jurídica del Estado "]
["Porcentaje de Fichas allegadas y presentadas ante el comité de conciliación","Institucional","Robustecer la capacidad de gestión y desempeño de las entidades del sector","Mejorar las políticas de gestión y desempeño","I. Pacto por la legalidad: seguridad efectiva y justicia transparente para que todos vivamos con libertad y en democracia","B. Imperio de la ley: derechos humanos, justicia accesible, oportuna y en toda Colombia, para todos","Objetivo 5. Defensa jurídica del Estado ","ODS 16. Paz, justicia e instituciones sólidas","-","Dimensión 3. Gestión con Valores para Resultados","Procesos Judiciales y Acciones Constitucionales","Porcentaje de Fichas allegadas y presentadas ante el comité de conciliación","(Fichas presentadas ante el comité/Fichas allegadas mes)*100","Controlar que todos los casos que se presenten, sean llevados al comité de conciliación","Variable 1 Fichas presentadas ante el comité: asuntos allegados por los apoderados y efectivamente presentados ante el comité para emitir concepto","Variable 2 Fichas allegadas mes: asuntos allegados por los apoderados en el mes que requieren ser sometidos a comité de conciliación","Constante","2019-12-31","Actas del Comité de Conciliacion","NA","Trimestral","Eficacia","Porcentaje",0,100,100,100,100,100,"OAJ-Oficina Asesora Jurídica",false,null,null,"Gestión",180,null,"Transversal","I. Pacto por la legalidad: seguridad efectiva y justicia transparente para que todos vivamos con libertad y en democracia","B. Imperio de la ley: derechos humanos, justicia accesible, oportuna y en toda Colombia, para todos","Objetivo 5. Defensa jurídica del Estado "]
["Porcentaje de respuestas a conceptos, peticiones, reclamaciones y solicitudes de revisión normativa emitidas en término","Institucional","Robustecer la capacidad de gestión y desempeño de las entidades del sector","Promover la implementación de la gestión del conocimiento e innovación en el ministerio","I. Pacto por la legalidad: seguridad efectiva y justicia transparente para que todos vivamos con libertad y en democracia","C. Alianza contra la corrupción: tolerancia cero con los corruptos","Objetivo 1. Pacto de cero tolerancia a la corrupción y a la falta de transparencia","ODS 16. Paz, justicia e instituciones sólidas","-","Dimensión 6. Gestión del Conocimiento ","Conceptos Jurídicos","Porcentaje de respuestas a conceptos, peticiones, reclamaciones y solicitudes de revisión normativa emitidas en término","(Repuestas emitidas en término/ Solicitudes recibidas en término)*100","Determinar que las respuestas sean emitidas dentro de los términos legales que impone la normatividad vigente","Variable 1 Repuestas emitidas en término: las respuestas con radicado de salida dentro de los términos que determina la normatividad vigente","Variable 2 Solicitudes recibidas: la totalidad de los requerimientos recibidos por la OAJ respecto a conceptos, peticiones, reclamaciones y solicitudes de revisión normativa","Constante","2019-12-31","Cuadro control consultas CJR-F-03 y cuadro de asignaciones y análisis reclamaciones CJR-F-01",null,"Trimestral","Eficiencia","Porcentaje",100,0,100,100,100,100,"OAJ-Oficina Asesora Jurídica",false,null,null,"Gestión",180,null,"Transversal ","I. Pacto por la legalidad: seguridad efectiva y justicia transparente para que todos vivamos con libertad y en democracia","C. Alianza contra la corrupción: tolerancia cero con los corruptos","Objetivo 1. Pacto de cero tolerancia a la corrupción y a la falta de transparencia"]
["Porcentaje de sanciones allegadas respecto a las tutelas allegadas","Institucional","Robustecer la capacidad de gestión y desempeño de las entidades del sector","Mejorar las políticas de gestión y desempeño","I. Pacto por la legalidad: seguridad efectiva y justicia transparente para que todos vivamos con libertad y en democracia","B. Imperio de la ley: derechos humanos, justicia accesible, oportuna y en toda Colombia, para todos","Objetivo 5. Defensa jurídica del Estado ","ODS 16. Paz, justicia e instituciones sólidas","-","Dimensión 3. Gestión con Valores para Resultados","Procesos Judiciales y Acciones Constitucionales","Porcentaje de sanciones allegadas respecto a las tutelas allegadas","[(100 x Sanciones allegadas en el periodo) / (Tutelas allegadas en el periodo)]","Determinar la efectividad de la defensa judicial ejercida por parte de la OAJ, al impedir fallos adversos a la entidad","Variable 1 Sanciones allegadas en el periodo: corresponde a las sanciones presentadas en el periodo objeto de medición.","Variable 2 Tutelas allegadas en el periodo: corresponde a las tutelas presentadas en el periodo objeto de medición","Constante","2019-12-31","Reporte mensual de comparativo de tutelas en el PEI",null,"Mensual","Resultado","Porcentaje",0.31,0.31,0.31,0.31,0.31,0.31,"OAJ-Oficina Asesora Jurídica",false,null,null,"Gestión",180,null,"Estructural ","I. Pacto por la legalidad: seguridad efectiva y justicia transparente para que todos vivamos con libertad y en democracia","B. Imperio de la ley: derechos humanos, justicia accesible, oportuna y en toda Colombia, para todos","Objetivo 5. Defensa jurídica del Estado "]
["Tasa de exito procesal","Institucional","Robustecer la capacidad de gestión y desempeño de las entidades del sector","Mejorar las políticas de gestión y desempeño","I. Pacto por la legalidad: seguridad efectiva y justicia transparente para que todos vivamos con libertad y en democracia","B. Imperio de la ley: derechos humanos, justicia accesible, oportuna y en toda Colombia, para todos","Objetivo 5. Defensa jurídica del Estado ","ODS 16. Paz, justicia e instituciones sólidas","-","Dimensión 3. Gestión con Valores para Resultados","Procesos Judiciales y Acciones Constitucionales","Tasa de exito procesal","(Número de procesos en contra de la entidad terminados con fallo favorable / Total número de procesos en contra de la entidad terminados)*100","Medir la tasa de exito procesal","Variable 1: Número de procesos en contra de la entidad terminados (ejecutoriados)","Variable 2: Total número de procesos en contra de la entidad terminados (ejecutoriado)  ","Creciente","2020-12-31","Sistema de Informacion eKOGUI",null,"Semestral","Eficacia ","Porcentaje",82,0,0,83,84,84,"OAJ-Oficina Asesora Jurídica",false,null,null,"Gestión",180,null,"Estructural ","I. Pacto por la legalidad: seguridad efectiva y justicia transparente para que todos vivamos con libertad y en democracia","B. Imperio de la ley: derechos humanos, justicia accesible, oportuna y en toda Colombia, para todos","Objetivo 5. Defensa jurídica del Estado "]
["Crecimiento del puntaje asignado a la Política de Control Interno (CI) a partir del FURAG","Institucional","Robustecer la capacidad de gestión y desempeño de las entidades del sector","Mejorar las políticas de gestión y desempeño","XV. Pacto por una gestión pública efectiva","\nA. Transformación de la administración\nPública","Objetivo 2. Mejorar la eficiencia y productividad en la gestión y las capacidades de las entidades públicas de los sectores","ODS 16. Paz, justicia e instituciones sólidas","-","Dimensión 3. Gestión con Valores para Resultados","Direccionamiento Estratégico","Crecimiento del puntaje asignado a la Política de Control Interno (CI) a partir del FURAG","Puntaje Política CI del año (t) - Puntaje Política CI del año (t-1)","Medir el avance en la implementación de la política de Control Interno (CI) del Modelo Integrado de Planeación y Gestión (MIPG) en el ministerio a partir del Formulario Único de Registro de Avances de Gestión (FURAG)","Variable 1Puntaje Política de Planeación Institucional del año (t): corresponde al puntaje obtenido por el ministerio en el Informe de Gestión y Desempeño Institucional del Departamento Administrativo de la Función Pública (DAFP), en el año objeto de medición de la política de Control Interno (CI)","Variable 2 Puntaje Política de Planeación Institucional del año (t-1): corresponde al puntaje obtenido por el ministerio en el Informe de Gestión y Desempeño Institucional del Departamento Administrativo de la Función Pública (DAFP), en el año anterior al periodo objeto de medición de la política de Control Interno (CI)","Creciente","2018-12-31","Departamento Administrativo de la Función Pública (DAFP)",180,"Anual","Eficacia","Número",60.8,2,2,3,3,10,"OAP-Oficina Asesora de Planeación ",null,null,null,"Gestión",null,null,"Transversal","XV. Pacto por una gestión pública efectiva","\nA. Transformación de la administración\nPública","Objetivo 2. Mejorar la eficiencia y productividad en la gestión y las capacidades de las entidades públicas de los sectores","ODS 11. Ciudades y comunidades sostenibles"]
["Crecimiento del puntaje asignado a la Política de Fortalecimiento Organizacional  y Simplificación de Procesos FOSP a partir del FURAG","Institucional","Robustecer la capacidad de gestión y desempeño de las entidades del sector","Mejorar las políticas de gestión y desempeño","XV. Pacto por una gestión pública efectiva","\nA. Transformación de la administración\nPública","Objetivo 2. Mejorar la eficiencia y productividad en la gestión y las capacidades de las entidades públicas de los sectores","ODS 16. Paz, justicia e instituciones sólidas","-","Dimensión 3. Gestión con Valores para Resultados","Direccionamiento Estratégico","Crecimiento del puntaje asignado a la Política de Fortalecimiento Organizacional  y Simplificación de Procesos FOSP a partir del FURAG","Puntaje Política FOSP del año (t) - Puntaje Política FOSP del año (t-1)","Medir el avance en la implementación de la política de Fortalecimiento Organizacional  y Simplificación de Procesos (FOSP) del Modelo Integrado de Planeación y Gestión (MIPG) en el ministerio a partir del Formulario Único de Registro de Avances de Gestión (FURAG)","Variable 1Puntaje Política de Planeación Institucional del año (t): corresponde al puntaje obtenido por el ministerio en el Informe de Gestión y Desempeño Institucional del Departamento Administrativo de la Función Pública (DAFP), en el año objeto de medición de la política de Fortalecimiento Organizacional  y Simplificación de Procesos (FOSP)","Variable 2 Puntaje Política de Planeación Institucional del año (t-1): corresponde al puntaje obtenido por el ministerio en el Informe de Gestión y Desempeño Institucional del Departamento Administrativo de la Función Pública (DAFP), en el año anterior al periodo objeto de medición de la política de Fortalecimiento Organizacional  y Simplificación de Procesos (FOSP)","Creciente","2018-12-31","Departamento Administrativo de la Función Pública (DAFP)",180,"Anual","Eficacia","Número",64.2,2,2,3,3,10,"OAP-Oficina Asesora de Planeación ",null,null,null,"Gestión",null,null,"Transversal","XV. Pacto por una gestión pública efectiva","\nA. Transformación de la administración\nPública","Objetivo 2. Mejorar la eficiencia y productividad en la gestión y las capacidades de las entidades públicas de los sectores","ODS 11. Ciudades y comunidades sostenibles"]
["Crecimiento del puntaje asignado a la Política de Gestión del Conocimiento y la Innovación (GCI) a partir del FURAG ","Institucional","Robustecer la capacidad de gestión y desempeño de las entidades del sector","Promover la implementación de la gestión del conocimiento e innovación en el ministerio","V. Pacto por la ciencia, la tecnología y la innovación: un sistema para construir el conocimiento de la Colombia del futuro","D. Innovación pública para un país moderno","Objetivo 5. Gestionar el conocimiento y los aprendizajes para crear valor público","ODS 16. Paz, justicia e instituciones sólidas","-","Dimensión 6. Gestión del Conocimiento ","Direccionamiento Estratégico","Crecimiento del puntaje asignado a la Política de Gestión del Conocimiento y la Innovación (GCI) a partir del FURAG ","Puntaje Política de GCI del año (t) - Puntaje Política de GCI del año (t-1)","Medir el avance en la implementación de la política de Gestión del Conocimiento y la Innovación (GCI) del Modelo Integrado de Planeación y Gestión (MIPG) en el ministerio a partir del Formulario Único de Registro de Avances de Gestión (FURAG)","Variable 1Puntaje Política de Planeación Institucional del año (t): corresponde al puntaje obtenido por el ministerio en el Informe de Gestión y Desempeño Institucional del Departamento Administrativo de la Función Pública (DAFP), en el año objeto de medición de la política de Gestión del Conocimiento y la Innovación (GCI) ","Variable 2 Puntaje Política de Planeación Institucional del año (t-1): corresponde al puntaje obtenido por el ministerio en el Informe de Gestión y Desempeño Institucional del Departamento Administrativo de la Función Pública (DAFP), en el año anterior al periodo objeto de medición de la política de Gestión del Conocimiento y la Innovación (GCI) ","Creciente","2018-12-31","Departamento Administrativo de la Función Pública (DAFP)",180,"Anual","Eficacia","Número",68.900000000000006,2,2,3,3,10,"OAP-Oficina Asesora de Planeación ",null,null,null,"Gestión",null,null,"Estructural","V. Pacto por la ciencia, la tecnología y la innovación: un sistema para construir el conocimiento de la Colombia del futuro","D. Innovación pública para un país moderno","Objetivo 5. Gestionar el conocimiento y los aprendizajes para crear valor público","ODS 11. Ciudades y comunidades sostenibles","SI"]
["Crecimiento del puntaje asignado a la Política de Participación Ciudadana y Rendición de Cuentas PCRC a partir del FURAG","Institucional","Robustecer la capacidad de gestión y desempeño de las entidades del sector","Fortalecer los estándares de transparencia y diálogo con la ciudadanía y los grupos de valor","I. Pacto por la legalidad: seguridad efectiva y justicia transparente para que todos vivamos con libertad y en democracia","C. Alianza contra la corrupción: tolerancia cero con los corruptos","Objetivo 1. Pacto de cero tolerancia a la corrupción y a la falta de transparencia","ODS 16. Paz, justicia e instituciones sólidas","-","Dimensión 3. Gestión con Valores para Resultados","Direccionamiento Estratégico","Crecimiento del puntaje asignado a la Política de Participación Ciudadana y Rendición de Cuentas PCRC a partir del FURAG","Puntaje asignado a la Política de PCRC del año (t) - Puntaje asignado a la de PCRC del año (t-1)","Medir el avance en la implementación de la política de Participación Ciudadana y Rendición de Cuentas (PCRC) del Modelo Integrado de Planeación y Gestión (MIPG) en el ministerio a partir del Formulario Único de Registro de Avances de Gestión (FURAG)","Variable 1Puntaje Política de Planeación Institucional del año (t): corresponde al puntaje obtenido por el ministerio en el Informe de Gestión y Desempeño Institucional del Departamento Administrativo de la Función Pública (DAFP), en el año objeto de medición de la política de Participación Ciudadana y Rendición de Cuentas (PCRC)","Variable 2 Puntaje Política de Planeación Institucional del año (t-1): corresponde al puntaje obtenido por el ministerio en el Informe de Gestión y Desempeño Institucional del Departamento Administrativo de la Función Pública (DAFP), en el año anterior al periodo objeto de medición de la política de Participación Ciudadana y Rendición de Cuentas (PCRC)","Creciente","2018-12-31","Departamento Administrativo de la Función Pública (DAFP)",180,"Anual","Eficacia","Número",76.8,2,2,3,3,10,"OAP-Oficina Asesora de Planeación ",null,null,null,"Gestión",null,null,"Estructural","I. Pacto por la legalidad: seguridad efectiva y justicia transparente para que todos vivamos con libertad y en democracia","C. Alianza contra la corrupción: tolerancia cero con los corruptos","Objetivo 1. Pacto de cero tolerancia a la corrupción y a la falta de transparencia","ODS 11. Ciudades y comunidades sostenibles","SI"]
["Crecimiento del puntaje asignado a la política de Planeación Institucional (PI) a partir del FURAG","Institucional","Robustecer la capacidad de gestión y desempeño de las entidades del sector","Fortalecer los estándares de transparencia y diálogo con la ciudadanía y los grupos de valor","I. Pacto por la legalidad: seguridad efectiva y justicia transparente para que todos vivamos con libertad y en democracia","C. Alianza contra la corrupción: tolerancia cero con los corruptos","Objetivo 1. Pacto de cero tolerancia a la corrupción y a la falta de transparencia","ODS 16. Paz, justicia e instituciones sólidas","-","Dimensión 2. Direccionamiento Estratégico y Planeación ","Direccionamiento Estratégico","Crecimiento del puntaje asignado a la política de Planeación Institucional (PI) a partir del FURAG","Puntaje Política de Planeación Institucional del año (t) - Puntaje Política de Planeación Institucional del año (t-1)","Medir el avance en la implementación de la política de Planeación Institucional (PI) del Modelo Integrado de Planeación y Gestión (MIPG) en el ministerio a partir del Formulario Único de Registro de Avances de Gestión (FURAG)","Variable 1Puntaje Política de Planeación Institucional del año (t): corresponde al puntaje obtenido por el ministerio en el Informe de Gestión y Desempeño Institucional del Departamento Administrativo de la Función Pública (DAFP), en el año objeto de medición de la política de Planeación Institucional (PI)","Variable 2 Puntaje Política de Planeación Institucional del año (t-1): corresponde al puntaje obtenido por el ministerio en el Informe de Gestión y Desempeño Institucional del Departamento Administrativo de la Función Pública (DAFP), en el año anterior al periodo objeto de medición de la política de Planeación Institucional (PI)","Creciente","2018-12-31","Departamento Administrativo de la Función Pública (DAFP)",180,"Anual","Eficacia","Número",64,2,2,3,3,10,"OAP-Oficina Asesora de Planeación ",null,null,null,"Gestión",null,null,null,"I. Pacto por la legalidad: seguridad efectiva y justicia transparente para que todos vivamos con libertad y en democracia","C. Alianza contra la corrupción: tolerancia cero con los corruptos","Objetivo 1. Pacto de cero tolerancia a la corrupción y a la falta de transparencia"]
["Crecimiento del puntaje asignado a la Política de Racionalización de Trámites a partir del FURAG","Institucional","Robustecer la capacidad de gestión y desempeño de las entidades del sector","Fortalecer los estándares de transparencia y diálogo con la ciudadanía y los grupos de valor","I. Pacto por la legalidad: seguridad efectiva y justicia transparente para que todos vivamos con libertad y en democracia","C. Alianza contra la corrupción: tolerancia cero con los corruptos","Objetivo 1. Pacto de cero tolerancia a la corrupción y a la falta de transparencia","ODS 16. Paz, justicia e instituciones sólidas","-","Dimensión 3. Gestión con Valores para Resultados","Direccionamiento Estratégico","Crecimiento del puntaje asignado a la Política de Racionalización de Trámites a partir del FURAG","Puntaje asignado a la Política de PRT del año (t) - Puntaje asignado a la de PRT del año (t-1)","Medir el avance en la implementación de la política de Racionalización de Trámites (RT) del Modelo Integrado de Planeación y Gestión (MIPG) en el ministerio a partir del Formulario Único de Registro de Avances de Gestión (FURAG)","Variable 1Puntaje Política de Planeación Institucional del año (t): corresponde al puntaje obtenido por el ministerio en el Informe de Gestión y Desempeño Institucional del Departamento Administrativo de la Función Pública (DAFP), en el año objeto de medición de la política de  Racionalización de Trámites (RT)","Variable 2 Puntaje Política de Planeación Institucional del año (t-1): corresponde al puntaje obtenido por el ministerio en el Informe de Gestión y Desempeño Institucional del Departamento Administrativo de la Función Pública (DAFP), en el año anterior al periodo objeto de medición de la política de  Racionalización de Trámites (RT)","Creciente","2018-12-31","Departamento Administrativo de la Función Pública (DAFP)",180,"Anual","Eficacia","Número",71.2,2,2,3,3,10,"OAP-Oficina Asesora de Planeación ",null,null,null,"Gestión",null,null,null,"I. Pacto por la legalidad: seguridad efectiva y justicia transparente para que todos vivamos con libertad y en democracia","C. Alianza contra la corrupción: tolerancia cero con los corruptos","Objetivo 1. Pacto de cero tolerancia a la corrupción y a la falta de transparencia"]
["Crecimiento del puntaje asignado a la Política de Seguimiento y Evaluación  al Desempeño Institucional a partir del FURAG","Institucional","Robustecer la capacidad de gestión y desempeño de las entidades del sector","Mejorar las políticas de gestión y desempeño","XV. Pacto por una gestión pública efectiva","\nA. Transformación de la administración\nPública","Objetivo 1. Evaluar la arquitectura institucional del Gobierno con el fin de redefinir misiones, roles y competencias que permitan el funcionamiento eficiente del Estado en los diferentes niveles de gobierno","ODS 16. Paz, justicia e instituciones sólidas","-","Dimensión 4. Evaluación de Resultados","Seguimiento y Mejora Continua ","Crecimiento del puntaje asignado a la Política de Seguimiento y Evaluación  al Desempeño Institucional a partir del FURAG","Puntaje Política de Seguimiento y Evalución del Desempeño Institucional (SEDI) del año (t) - Puntaje Política de Seguimiento y Evaluación del Desempeño Institucional (SEDI)del año  (t-1)","Medir el avance en la implementación de la política de Seguimiento y Evaluación  al Desempeño Institucional (SEDI) del Modelo Integrado de Planeación y Gestión (MIPG) en el ministerio a partir del Formulario Único de Registro de Avances de Gestión (FURAG)","Variable 1Puntaje Política de Planeación Institucional del año (t): corresponde al puntaje obtenido por el ministerio en el Informe de Gestión y Desempeño Institucional del Departamento Administrativo de la Función Pública (DAFP), en el año objeto de medición de la política de Seguimiento y Evaluación  al Desempeño Institucional (SEDI)","Variable 2 Puntaje Política de Planeación Institucional del año (t-1): corresponde al puntaje obtenido por el ministerio en el Informe de Gestión y Desempeño Institucional del Departamento Administrativo de la Función Pública (DAFP), en el año anterior al periodo objeto de medición de la política de Seguimiento y Evaluación  al Desempeño Institucional (SEDI)","Creciente","2018-12-31","Departamento Administrativo de la Función Pública (DAFP)",180,"Anual","Eficacia","Número",68.5,2,2,3,3,10,"OAP-Oficina Asesora de Planeación ",null,null,null,"Gestión",null,null,null,"XV. Pacto por una gestión pública efectiva","\nA. Transformación de la administración\nPública","Objetivo 1. Evaluar la arquitectura institucional del Gobierno con el fin de redefinir misiones, roles y competencias que permitan el funcionamiento eficiente del Estado en los diferentes niveles de gobierno"]
["Nivel de cumplimiento del Plan Anual de Auditorías","Institucional","Robustecer la capacidad de gestión y desempeño de las entidades del sector","Mejorar las políticas de gestión y desempeño","I. Pacto por la legalidad: seguridad efectiva y justicia transparente para que todos vivamos con libertad y en democracia","C. Alianza contra la corrupción: tolerancia cero con los corruptos","Objetivo 1. Pacto de cero tolerancia a la corrupción y a la falta de transparencia","ODS 16. Paz, justicia e instituciones sólidas","-","Dimensión 7. Control Interno","Evaluación Independiente y Asesoría ","Nivel de cumplimiento del Plan Anual de Auditorías","(Número de actividades cumplidas/Número de actividades programadas en el plan)*100","Establecer el grado de cumplimiento de las actividades programadas en el Plan Anual de Auditoría en un periodo determinado","Variable 1 Actividades cumplidas: corresponde a las actividades del Plan Anual de Auditoría que realmente se ejecutaron en el mes","Variable 2  Actividades programadas: corresponde a la totalidad de las actividades mensuales programadas en el Plan Anual de Auditoría","Constante ","2019-12-31","Informe de Seguimiento mensual al PAA","NA","Mensual","Eficacia","Porcentaje",100,100,100,100,100,100,"OCI-Oficina de Control Interno",null,null,null,"Gestión",null,null,null,"I. Pacto por la legalidad: seguridad efectiva y justicia transparente para que todos vivamos con libertad y en democracia","C. Alianza contra la corrupción: tolerancia cero con los corruptos","Objetivo 1. Pacto de cero tolerancia a la corrupción y a la falta de transparencia"]
["Avance en el  Índice de Transparencia y Acceso a la Información (ITA) de la Procuraduría General de la Nación (PGN)","Institucional","Robustecer la capacidad de gestión y desempeño de las entidades del sector","Fortalecer los estándares de transparencia y diálogo con la ciudadanía y los grupos de valor","I. Pacto por la legalidad: seguridad efectiva y justicia transparente para que todos vivamos con libertad y en democracia","C. Alianza contra la corrupción: tolerancia cero con los corruptos","Objetivo 1. Pacto de cero tolerancia a la corrupción y a la falta de transparencia","ODS 16. Paz, justicia e instituciones sólidas","-","Dimensión 5.  Información y Comunicación ","Gestión de Tecnologías de la Información y las Comunicaciones","Avance en el  Índice de Transparencia y Acceso a la Información (ITA) de la Procuraduría General de la Nación (PGN)","Porcentaje de cumplimiento de los requisitos de la Ley de Transparencia y Acceso a la Información Pública","Medir el porcentaje en que el MVCT está cumpliendo con los requisitos exigidos por la Ley de Transparencia y Acceso a la Información Pública (Ley 1712 de 2014)","Variable 1 Porcentaje de cumplimiento: porcentaje en que el MVCT está cumpliendo con los requisitos exigidos por la Ley de Transparencia y Acceso a la Información Pública (Ley 1712 de 2014)",null,"Creciente","2019-12-31","Aplicativo ITA de la Procuraduría General de la Nación","N/A","Anual","Eficacia","Porcentaje",60,0,80,0,98,98,"OTIC-Oficina de Tecnologías de Información y Comunicaciones ",null,null,null,"Gestión",null,null,null,"I. Pacto por la legalidad: seguridad efectiva y justicia transparente para que todos vivamos con libertad y en democracia","C. Alianza contra la corrupción: tolerancia cero con los corruptos","Objetivo 1. Pacto de cero tolerancia a la corrupción y a la falta de transparencia"]
["Avance en la implementación de las actividades (mapa de ruta)  del PETI- 2018-2022","Institucional","Robustecer la capacidad de gestión y desempeño de las entidades del sector","Mejorar las políticas de gestión y desempeño","VII. Pacto por la transformación digital de Colombia: gobierno, empresas y hogares conectados con la era del conocimiento","B. Hacia una sociedad digital e industria 4.0: por una relación más eficiente, efectiva y transparente entre mercados, ciudadanos y Estado","Objetivo 1. Impulsar la transformación digital de la administración pública ","ODS 16. Paz, justicia e instituciones sólidas","-","Dimensión 3. Gestión con Valores para Resultados","Gestión de Tecnologías de la Información y las Comunicaciones","Avance en la implementación de las actividades (mapa de ruta)  del PETI- 2018-2022","(Número de hitos ejecutados/Número total de hitos programados para la vigencia)*100","Medir el cumplimiento de las actividades programadas en el Plan Estratégico de Tecnologías de la Información (PETI) del Ministerio de Vivienda, Ciudad y Territorio de la vigencia en curso","Variable 1: hitos  ejecutados: corresponde al total de hitos que va desarrollando la Oficina de Tecnologías de la Información y las Comunicaciones durante la vigencia en curso, en el marco del plan estratégico de tecnologías de la información","Variable 2: hitos programados: corresponde al total de hitos programados por la Oficina de Tecnologías de la Información y las Comunicaciones en en el plan estratégico de tecnologías de la información","Creciente","2019-12-31","Plan Estratégico de Tecnologías de la Información (PETI) aprobado por el MVCT","N/A","Semestral","Eficacia ","Porcentaje",0,0,50,70,100,100,"OTIC-Oficina de Tecnologías de Información y Comunicaciones ",null,null,null,"Gestión",null,null,null,"VII. Pacto por la transformación digital de Colombia: gobierno, empresas y hogares conectados con la era del conocimiento","B. Hacia una sociedad digital e industria 4.0: por una relación más eficiente, efectiva y transparente entre mercados, ciudadanos y Estado","Objetivo 1. Impulsar la transformación digital de la administración pública "]
["Porcentaje de implementación del Sistema de Información Transaccional","Institucional","Robustecer la capacidad de gestión y desempeño de las entidades del sector","Fortalecer los estándares de transparencia y diálogo con la ciudadanía y los grupos de valor","XVI. Pacto por la descentralización: conectar territorios, gobiernos y poblaciones","E. Instrumentos e información para la toma de decisiones que promuevan el desarrollo regional","Objetivo 2. Promover la implementación de la infraestructura de Datos Espaciales","ODS 11. Ciudades y comunidades sostenibles","-","Dimensión 5.  Información y Comunicación ","Gestión de Tecnologías de la Información y las Comunicaciones","Porcentaje de implementación del Sistema de Información Transaccional","(Progreso de la conceptualización, diseño e implementación del Sistema de Información Transaccional/ Totalidad Sistema de Información Transaccional)*100","Medir el progreso en la conceptualización, diseño e implementación del Sistema de Información Transaccional","Variable 1 Progreso en la conceptualización, diseño e implementación del Sistema de Información Transaccional: consiste en la definición de los hitos de avance del proyecto","Variable 2 Totalidad Sistema de Información Transaccional: corresponde a los artefactos desde la fase de diseño hasta la implementación  del Sistema de Información Transaccional","Suma","2018-12-31","Ministerio de Vivienda Ciudad y Territorio, Proceso de contratación del Sistema de información SISFV, Equipo de trabajo Terra (DEUT+SISFV), Documento estudio de Mercado SISFV, Términos de Referencia SISFV, Presentación estado sistema transaccional, Definición metodología recopilación de información curadurías urbanas, Plan de trabajo curadurías Bogotá y Cali.","N/A","Semestral","Producto","Porcentaje",0,5,35,50,10,100,"OTIC-Oficina de Tecnologías de Información y Comunicaciones ",null,null,null,"PND",null,null,null,"XVI. Pacto por la descentralización: conectar territorios, gobiernos y poblaciones","E. Instrumentos e información para la toma de decisiones que promuevan el desarrollo regional","Objetivo 2. Promover la implementación de la infraestructura de Datos Espaciales"]
["Estados Financieros presentados","Institucional","Robustecer la capacidad de gestión y desempeño de las entidades del sector","Mejorar las políticas de gestión y desempeño","XV. Pacto por una gestión pública efectiva","B. Gasto público efectivo","Objetivo 1. Fortalecer los instrumentos para la asignación estratégica y responsabilidad del gasto público ","ODS 16. Paz, justicia e instituciones sólidas","-","Dimensión 2. Direccionamiento Estratégico y Planeación ","Gestión Financiera","Estados Financieros presentados","Número de informes","Medir el cumplimiento en la presentación oportuna de los estados financieros de la entidad, a la Contaduría General de la Nación","Variable 1Variable 1: Informes de Estados Financieros: Son un conjunto de informes cuya finalidad principal es suministrar la información contable de la entidad a todos los terceros interesados en la misma. Corresponde a los Informes financieros Trimestrales que se deben transmitir a la Contaduría General de la Nación conforme al cronograma establecidos para tal fin.",null,"Suma","2019-12-31","Sistema de Información Financiera (SIIF) Nación","NA","Trimestral","Producto","Número",4,4,4,4,4,16,"SFP-Subdirección de Finanzas y Presupuesto",null,null,null,"Gestión",null,null,null,"XV. Pacto por una gestión pública efectiva","B. Gasto público efectivo","Objetivo 1. Fortalecer los instrumentos para la asignación estratégica y responsabilidad del gasto público "]
["Informe de Seguimiento a la Ejecución Presupuestal","Institucional","Robustecer la capacidad de gestión y desempeño de las entidades del sector","Mejorar las políticas de gestión y desempeño","XV. Pacto por una gestión pública efectiva","B. Gasto público efectivo","Objetivo 1. Fortalecer los instrumentos para la asignación estratégica y responsabilidad del gasto público ","ODS 16. Paz, justicia e instituciones sólidas","-","Dimensión 2. Direccionamiento Estratégico y Planeación ","Gestión Financiera","Informe de Seguimiento a la Ejecución Presupuestal","Número de informes","Realizar el seguimiento a la ejecución presupuestal, con el fin de conocer en forma oportuna y veraz, el estado presupuestal de la entidad","Variable 1 Informes: corresponde al número de informes de seguimiento a la ejecución presupuestal realizados por la SFP durante la vigencia",null,"Suma","2019-12-31","Sistema de Información Financiera (SIIF) Nación","NA","Mensual","Producto","Número",0,0,12,12,12,36,"SFP-Subdirección de Finanzas y Presupuesto",null,null,null,"Gestión",null,null,null,"XV. Pacto por una gestión pública efectiva","B. Gasto público efectivo","Objetivo 1. Fortalecer los instrumentos para la asignación estratégica y responsabilidad del gasto público "]
["PAC ejecutado","Institucional","Robustecer la capacidad de gestión y desempeño de las entidades del sector","Mejorar las políticas de gestión y desempeño","XV. Pacto por una gestión pública efectiva","B. Gasto público efectivo","Objetivo 1. Fortalecer los instrumentos para la asignación estratégica y responsabilidad del gasto público ","ODS 16. Paz, justicia e instituciones sólidas","-","Dimensión 2. Direccionamiento Estratégico y Planeación ","Gestión Financiera","PAC ejecutado","(PAC ejecutado / PAC asignado)*100","Medir el cumplimiento de ejecución del PAC frente a los recursos asignados a la entidad","Variable 1 Plan Anual de Caja (PAC) ejecutado: corresponde a la ejecución anual de los recursos disponibles para el pago de las obligaciones que debe adelantar la entidad, cuyo seguimiento se realiza de manera mensual","Variable 2 Plan Anual de Caja (PAC) asignado: corresponde a la asignación anual de recursos que realiza el Tesoro Nacional para el pago de las obligaciones de la entidad, es asignado mensualmente a cada dependencia y consolidado por el grupo de tesorería de la entidad","Constante","2019-12-31","Sistema de Información Financiera (SIIF) Nación","NA","Trimestral","Eficacia ","Porcentaje",90,90,90,90,90,90,"SFP-Subdirección de Finanzas y Presupuesto",null,null,null,"Gestión",null,null,null,"XV. Pacto por una gestión pública efectiva","B. Gasto público efectivo","Objetivo 1. Fortalecer los instrumentos para la asignación estratégica y responsabilidad del gasto público "]
["Activos del extinto ICT INURBE intervenidos","Institucional","Robustecer la capacidad de gestión y desempeño de las entidades del sector","Mejorar las políticas de gestión y desempeño","XV. Pacto por una gestión pública efectiva","B. Gasto público efectivo","Objetivo 3. Optimizar la administración del patrimonio del Estado y la gestión de activos","ODS 16. Paz, justicia e instituciones sólidas",null,"Dimensión 3. Gestión con Valores para Resultados","Saneamiento de Activos de los Extintos ICT INURBE","Activos del extinto ICT INURBE intervenidos","(Número de activos del extinto ICT INURBE intevenidos / Número de Activos de los extintos ICT INURBE recibidos)*100","Medir el avance en el saneamiento de activos del MVCT","Variable 1 Activos del extinto ICT-INURBE intervenidos: activos de los extintos ICT-INURBE intervenidos: corresponde a la cantidad de predios a los cuales se les ha adelantado algunas de las actividades necesarias para lograr el saneamiento integral.","Variable 2 Activos de los extintos ICT - INURBE  recibidos: Corresponde al numero de registros recibidos a través de Acta de febrero del 2014.","Creciente ","2020-10-27","Informes de activos de la SSA",0,"Mensual","Eficacia ","Porcentaje",37.31,"N/A",56,58.3,60.6,60.6,"SSA-Subdirección de Servicios Administrativos",null,null,null,"Gestión",null,null,null,"XV. Pacto por una gestión pública efectiva","B. Gasto público efectivo","Objetivo 3. Optimizar la administración del patrimonio del Estado y la gestión de activos"]
["Avance en la ejecución del Plan Anual de Adquisiciones (PAA) formulado y actualizado de los gastos de funcionamiento que son competencia de la SSA","Institucional","Robustecer la capacidad de gestión y desempeño de las entidades del sector","Mejorar las políticas de gestión y desempeño","XV. Pacto por una gestión pública efectiva","B. Gasto público efectivo","Objetivo 2. Simplificar y optimizar la contratación pública ","ODS 16. Paz, justicia e instituciones sólidas","-","Dimensión 2. Direccionamiento Estratégico y Planeación ","Gestión de Recursos Físicos","Avance en la ejecución del Plan Anual de Adquisiciones (PAA) formulado y actualizado de los gastos de funcionamiento que son competencia de la SSA","(Recursos del PAA ejecutados/Recursos del PAA asignados)*100","Medir el avance en la ejecución de los recursos asignados en el Plan Anual de Adquisiciones de la vigencia en curso, para los gastos de funcionamiento que son competencia de la SSA","Variable 1 Recursos ejecutados: corresponde a los recursos presupuestales que se van ejecutando durante la vigencia en curso, para los gastos de funcionamiento que son competencia de la SSA, en el marco del plan anual de adquisiciones","Variable 2 Recursos asignados: corresponde al total de los recursos presupuestales que fueron asignados o programados para los gastos de funcionamiento que son competencia de la SSA, en el marco del plan anual de adquisiciones para la vigencia en curso","Constante","2018-12-31","Subdirección de Servicios Administrativos (SSA)",0,"Mensual ","Eficacia","Porcentaje",96,96,96,96,96,96,"SSA-Subdirección de Servicios Administrativos",null,null,null,"Gestión",null,null,null,"XV. Pacto por una gestión pública efectiva","B. Gasto público efectivo","Objetivo 2. Simplificar y optimizar la contratación pública "]

{"sheet":"Base Procesos y Riesgos","index":11,"n_rows":119,"n_cols":5,"rows_kept":119,"cut":false,"hidden":true,"merged":[[0,0,0,4]]}
["RESULTADOS DE LA GESTIÓN DE RIESGO MVCT"]
[]
["Tipo de Proceso","Proceso","Código","Riesgos","Tipología de Riesgos"]
["Estratégico","Direccionamiento Estratégico","P_1","\n\nInadecuada planeación estratégica y operativa.","Gestión"]
["Estratégico","Direccionamiento Estratégico","P_1","Inadecuada planeación del proceso","Gestión"]
["Estratégico","Direccionamiento Estratégico","P_1","Pérdida de la información digital que soporta la gestión de los instrumentos de planeación ","Seguridad Digital"]
["Estratégico","Direccionamiento Estratégico","P_1","Pérdida o deterioro de la información contenida en los archivos de gestión del proceso de Direccionamiento Estratégico","Seguridad Digital"]
["Estratégico","Direccionamiento Estratégico","P_1","Inadecuada supervisión en el seguimiento de la ejecución de los contratos/convenios de acuerdo a la normatividad legal vigente","Gestión"]
["Estratégico","Gestión de Tecnologías de la Información y las Comunicaciones","P_2","Uso indebido de la información en beneficio propio o de un tercero","Corrupción"]
["Estratégico","Gestión de Tecnologías de la Información y las Comunicaciones","P_2","Inadecuada prestación de servicio de soporte técnico","Gestión"]
["Estratégico","Gestión de Tecnologías de la Información y las Comunicaciones","P_2","Pérdida o deterioro de la información contenida en los archivos de gestión","Seguridad Digital"]
["Estratégico","Gestión de Tecnologías de la Información y las Comunicaciones","P_2","Alteración de la Información en los sistemas de información que administran el proceso","Seguridad Digital"]
["Estratégico","Gestión de Tecnologías de la Información y las Comunicaciones","P_2","Incumplimiento en la ejecución de las actividades de gestión enmarcadas en los planes institucionales","Gestión"]
["Estratégico","Gestión de Tecnologías de la Información y las Comunicaciones","P_2","Pérdida de acceso a los aplicativos del MVCT ","Seguridad Digital"]
["Estratégico","Gestión de Tecnologías de la Información y las Comunicaciones","P_2","Pérdida de información digital de los repositos administrador por la OTIC","Seguridad Digital"]
["Estratégico","Gestión de Tecnologías de la Información y las Comunicaciones","P_2","Inadecuada supervisión en el seguimiento de la ejecución de los contratos/convenios de acuerdo con la normatividad legal vigente","Gestión"]
["Estratégico","Gestión Estratégica de Talento Humano","P_3","Nombramientos de personal del MVCT sin el cumplimiento de los requisitos exigidos para el cargo para favorecer a un tercero","Corrupción"]
["Estratégico","Gestión Estratégica de Talento Humano","P_3","Insuficiencia de Recursos necesarios para realizar las actividades encomendadas a Entidad en materia de planta del personal","Gestión"]
["Estratégico","Gestión Estratégica de Talento Humano","P_3","Incumplimiento de las actividades de los planes y programas para el desarrollo del talento Humano de la entidad dentro de la Planeación Estratégica de GTH","Gestión"]
["Estratégico","Gestión Estratégica de Talento Humano","P_3","Incumplimiento de los requisitos del Sistema de Gestión de Seguridad y Salud en el Trabajo","Gestión"]
["Estratégico","Gestión Estratégica de Talento Humano","P_3","Inconsistencias en la nómina por inclusión extemporánea de las novedades","Gestión"]
["Estratégico","Gestión Estratégica de Talento Humano","P_3","Pérdida o deterioro de la Información contenida en los archivos de gestión del Grupo de Talento Humano","Seguridad Digital"]
["Estratégico","Gestión Estratégica de Talento Humano","P_3","Fuga del capital intelectual del proceso","Gestión"]
["Estratégico","Gestión Estratégica de Talento Humano","P_3","Inadecuada supervisión en el seguimiento de la ejecución de los contratos/convenios","Gestión"]
["Estratégico","Gestión de Comunicaciones Internas y Externas","P_4","Información noticiosa imprecisa","Gestión"]
["Estratégico","Gestión de Comunicaciones Internas y Externas","P_4","Inadecuada supervisión en el seguimiento de la ejecución de los contratos/convenios de acuerdo con la normatividad legal vigente","Gestión"]
["Estratégico","Relaciones Estratégicas ","P_5","Inoportunidad en la gestión de los requerimientos y remisión de respuesta a las solicitudes de información de las partes interesadas (sector político y cooperantes)","Gestión"]
["Estratégico","Relaciones Estratégicas ","P_5","Inoportunidad en la identificación de proyectos de ley que impacten la política del Ministerio","Gestión"]
["Estratégico","Relaciones Estratégicas ","P_5","Inadecuada gestión de  la participación del Ministerio en foros, cursos, cumbres y encuentros nacionales e internacionales  ","Gestión"]
["Estratégico","Relaciones Estratégicas ","P_5","Inadecuada gestión de seguimiento en el relacionamiento con cooperantes ","Gestión"]
["Estratégico","Relaciones Estratégicas ","P_5","Pérdida o deterioro de la información contenida en los archivos de gestión.","Seguridad Digital"]
["Estratégico","Relaciones Estratégicas ","P_5","Inadecuada supervisión en el seguimiento de la ejecución de los contratos/convenios de acuerdo con la normatividad legal vigente","Gestión"]
["Misional","Gestión a la Política de Espacio Urbano y Territorial ","P_6","Visualizar proyectos de operaciones urbanas integrales sin el cumplimiento de requisitos jurídicos, financieros, técnicos y urbanísticos","Gestión"]
["Misional","Gestión a la Política de Espacio Urbano y Territorial ","P_6","Incumplimiento del objeto del contrato celebrado con un operador para la ejecución de los proyectos de mejoramiento integral de barrios","Gestión"]
["Misional","Gestión a la Política de Espacio Urbano y Territorial ","P_6","Pérdida o deterioro de la información contenida en los archivos de gestión","Seguridad Digital"]
["Misional","Gestión a la Política de Espacio Urbano y Territorial ","P_6","Formular la política o instrumento normativo sin el cumplimiento de los requisitos legales para beneficios de terceros","Corrupción"]
["Misional","Gestión a la Política de Espacio Urbano y Territorial ","P_6","Inoportuna ejecución de las actividades de asistencia técnica, promoción y/o acompañamiento definidas por la Dirección de Espacio Urbano y Territorial o por la Subdirección de Asistencia Técnica y Operaciones Urbanas Integrales; para la vigencia","Gestión"]
["Misional","Gestión a la Política de Espacio Urbano y Territorial ","P_6","Inadecuada promoción y acompañamiento y/o asistencia técnica en función de los requerimientos de los diferentes grupos de interés realizados por la Dirección de Espacio Urbano y Territorial  o por la Subdirección de Asistencia Técnica  y operaciones urbanas integrales para la vigencia","Gestión"]
["Misional","Gestión a la Política de Espacio Urbano y Territorial ","P_6","Incumplimiento a las actividades planeadas dentro del Plan de Acción Institucional (PAI)\n","Gestión"]
["Misional","Gestión a la Política de Espacio Urbano y Territorial ","P_6","Inadecuada supervisión en el seguimiento de la ejecución de los contratos/convenios de acuerdo a la normatividad legal vigente \n","Gestión"]
["Misional","Gestión a la Política de Agua Potable y Saneamiento Básico","P_7","Incumplimiento a las actividades planeadas dentro del Plan Estratégico Institucional y el Plan de Acción Institucional (PAI)","Gestión"]
["Misional","Gestión a la Política de Agua Potable y Saneamiento Básico","P_7","Gestionar la Política de agua potable y saneamiento básico mediante la formulación de instrumentos normativos y la posterior ejecución de planes, programas y proyectos, sin el cumplimiento de los requisitos legales y/o procedimentales vigentes, para favorecimiento propio o de un tercero.","Corrupción"]
["Misional","Gestión a la Política de Agua Potable y Saneamiento Básico","P_7","Pérdida o deterioro de la información contenida en los archivos de gestión","Seguridad Digital"]
["Misional","Gestión a la Política de Agua Potable y Saneamiento Básico","P_7","Inadecuada  e inoportuna Promoción y/o asistencia técnica en la gestión a la política de agua potable y saneamiento básico","Gestión"]
["Misional","Gestión a la Política de Agua Potable y Saneamiento Básico","P_7","Acceso indebido al Sistema de Inversiones en Agua Potable y Saneamiento Básico - SINAS","Seguridad Digital"]
["Misional","Gestión a la Política de Agua Potable y Saneamiento Básico","P_7","Inadecuada supervisión en el seguimiento de la ejecución de los contratos/convenios de acuerdo a la normatividad legal vigente ","Gestión"]
["Misional","Gestión a la Política de Vivienda","P_8","Gestionar la Política de vivienda  mediante la formulación de instrumentos normativos y la posterior ejecución de planes, programas y proyectos, sin el cumplimiento de los requisitos legales y/o procedimentales vigentes, para favorecimiento propio o de un tercero.","Corrupción"]
["Misional","Gestión a la Política de Vivienda","P_8","Incumplimiento a las actividades planeadas dentro del Plan de Acción Institucional (PAI)\n","Gestión"]
["Misional","Gestión a la Política de Vivienda","P_8","Inadecuada  e inoportuna promoción y/o acompañamiento \n","Gestión"]
["Misional","Gestión a la Política de Vivienda","P_8","Inoportunidad  del desembolso del SFV  debido al tramite de la autorización del pago","Gestión"]
["Misional","Gestión a la Política de Vivienda","P_8","Incumplimiento de obligaciones de contrato  o convenios celebrados con la entidad supervisora de los proyectos de Vivienda\n","Gestión"]
["Misional","Gestión a la Política de Vivienda","P_8","Transferir o levantar gravámenes de un inmueble de los extintos ICT-INURBE, mediante acto administrativo, incumpliendo los requisitos legales y/o procedimentales\n","Gestión"]
["Misional","Gestión a la Política de Vivienda","P_8","Inadecuada asistencia técnica y jurídica en Titulación y Saneamiento Predial \n","Gestión"]
["Misional","Gestión a la Política de Vivienda","P_8","Pérdida o deterioro de la información contenida en los archivos de gestión del proceso\n","Seguridad Digital"]
["Misional","Gestión a la Política de Vivienda","P_8","Acceso indebido a los sistemas de información del proceso.\n","Seguridad Digital"]
["Misional","Gestión a la Política de Vivienda","P_8","Inadecuada supervisión en el seguimiento de la ejecución de los contratos/convenios de acuerdo a la normatividad legal vigente\n","Gestión"]
["Apoyo","Gestión de Recursos Físicos","P_9","Recibir bienes mediante la aprobación de los documentos de entrega, sin el cumplimiento de las especificaciones técnicas solicitadas, para beneficiar a un tercero.","Corrupción"]
["Apoyo","Gestión de Recursos Físicos","P_9","Permitir el hurto o robo de los bienes que son propiedad del MVCT o por los cuales debe responder,  para beneficiar a un particular.","Corrupción"]
["Apoyo","Gestión de Recursos Físicos","P_9","Manejo inadecuado, pérdida o robo de los recursos financieros de las cajas menores del MVCT y FONVIVIENDA, para beneficio de un particular.","Corrupción"]
["Apoyo","Gestión de Recursos Físicos","P_9","Inoportunidad en el suministro de los bienes solicitados por las dependencias, administrados por el Proceso de Gestión de Recursos Físicos","Gestión"]
["Apoyo","Gestión de Recursos Físicos","P_9","Solicitud extemporánea del pago de las obligaciones a cargo del Grupo de Recursos Físicos.","Gestión"]
["Apoyo","Gestión de Recursos Físicos","P_9","Inadecuada gestión del trámite de comisiones o autorización de desplazamiento y permanencia.","Gestión"]
["Apoyo","Gestión de Recursos Físicos","P_9","Pérdida o deterioro de la información contenida en los archivos de gestión del Grupo de Recursos Físicos","Seguridad Digital"]
["Apoyo","Gestión de Recursos Físicos","P_9","Inadecuada supervisión en el seguimiento de la ejecución de los contratos/convenios de acuerdo con la normatividad legal vigente","Gestión"]
["Apoyo","Gestión de Contratación","P_10","Favorecimiento a un oferente o contratista en la adjudicación de un proceso de contratación, omitiendo la normatividad legal vigente que aplique para la modalidad de contratación seleccionada.","Corrupción"]
["Apoyo","Gestión de Contratación","P_10","Retraso, inconsistencia u omisiones en la suscripción de procesos contractuales","Gestión"]
["Apoyo","Gestión de Contratación","P_10","Inadecuada liquidación de contratos / convenios ","Gestión"]
["Apoyo","Gestión de Contratación","P_10","Pérdida o deterioro de la información contenida en los archivos de gestión","Seguridad Digital"]
["Apoyo","Gestión de Contratación","P_10","Inadecuada supervisión en el seguimiento de la ejecución de los contratos/convenios de acuerdo con la normatividad legal vigente","Gestión"]
["Apoyo","Procesos Judiciales y Acciones Constitucionales","P_11"," Ejercer la defensa técnica judicial del Ministerio de Vivienda, Ciudad y Territorio y del Fondo Nacional de Vivienda de manera inadecuada con el fin de favorecer a un tercero","Corrupción"]
["Apoyo","Procesos Judiciales y Acciones Constitucionales","P_11"," Omisión en la representación judicial o en los procesos judiciales, acciones populares, grupo y cumplimiento.","Gestión"]
["Apoyo","Procesos Judiciales y Acciones Constitucionales","P_11","Respuesta inadecuada a los requerimientos judiciales ","Gestión"]
["Apoyo","Procesos Judiciales y Acciones Constitucionales","P_11","Pérdida o deterioro de la información contenida en los archivos de gestión del proceso de Procesos Judiciales y Acciones Constitucionales","Seguridad Digital"]
["Apoyo","Procesos Judiciales y Acciones Constitucionales","P_11","Pérdida y/o alteración de la información digital ","Seguridad Digital"]
["Apoyo","Procesos Judiciales y Acciones Constitucionales","P_11","Inadecuada supervisión en el seguimiento de la ejecución de los contratos/convenios de acuerdo a la normatividad legal vigente","Gestión"]
["Apoyo","Procesos Judiciales y Acciones Constitucionales","P_11","Incremento en el pago de condenas en litigios que pueden ser solucionados antes de que se dé trámite a la acción judicial","Gestión"]
["Apoyo","Conceptos Jurídicos","P_12","Emitir conceptos jurídicos y/o reclamaciones sin la observancia de la normatividad aplicable y vigente para favorecer a terceros","Corrupción"]
["Apoyo","Conceptos Jurídicos","P_12","Emitir conceptos  y/o proyecto de respuesta a las reclamaciones de manera extemporánea","Gestión"]
["Apoyo","Conceptos Jurídicos","P_12","Pérdida o deterioro de la información contenida en los archivos de gestión del proceso de Conceptos Jurídicos","Seguridad Digital"]
["Apoyo","Conceptos Jurídicos","P_12","Inadecuada supervisión en el seguimiento de la ejecución de los contratos/convenios de acuerdo a la normatividad legal vigente","Gestión"]
["Apoyo","Procesos Disciplinarios","P_13","Omitir un acto propio de las funciones para favorecer al investigado","Corrupción"]
["Apoyo","Procesos Disciplinarios","P_13","Inoportunidad en el trámite de la acción disciplinaria ","Gestión"]
["Apoyo","Procesos Disciplinarios","P_13","Omisión en la realización de actividades de prevención de Ley Disciplinaria ","Gestión"]
["Apoyo","Procesos Disciplinarios","P_13","Pérdida o deterioro de la información contenida en los archivos de gestión del Grupo de Control Interno Disciplinario  ","Seguridad Digital"]
["Apoyo","Procesos Disciplinarios","P_13","Inadecuada supervisión en el seguimiento de la ejecución de los contratos/convenios de acuerdo a la normatividad legal vigente","Gestión"]
["Apoyo","Servicio al Ciudadano","P_14","Posibilidad de recibir dádivas para realizar trámites sin el cumplimiento de los requisitos","Corrupción"]
["Apoyo","Servicio al Ciudadano","P_14","Trámite inadecuado para la respuesta a los requerimientos de competencia del MVCT","Gestión"]
["Apoyo","Servicio al Ciudadano","P_14","Pérdida o deterioro de la información contenida en los archivos de gestión de componente Servicio al Ciudadano","Seguridad Digital"]
["Apoyo","Servicio al Ciudadano","P_14","Inadecuada supervisión en el seguimiento de la ejecución de los contratos/convenios de acuerdo a la normatividad legal vigente","Gestión"]
["Apoyo","Gestión Documental","P_15","Incumplimiento de la ejecución de las actividades planificadas en el Plan de Acción Institucional - PAI\n","Gestión"]
["Apoyo","Gestión Documental","P_15","Organización inadecuada de los archivos durante su ciclo vital: gestión y central.\n","Gestión"]
["Apoyo","Gestión Documental","P_15","Permitir o restringir el acceso a la información sin el cumplimiento de los requisitos legales para favorecer a un tercero.\n","Corrupción"]
["Apoyo","Gestión Documental","P_15","Deterioro de los soportes físicos de la información contenida en los archivos (Gestión y central) \n","Seguridad Digital"]
["Apoyo","Gestión Documental","P_15","Inadecuada supervisión en el seguimiento de la ejecución de los contratos/convenios de acuerdo a la normatividad legal vigente\n","Gestión"]
["Apoyo","Saneamiento de Activos de los Extintos ICT INURBE","P_16","Pérdida de un activo, bien fiscal, para beneficiar a un tercero","Corrupción"]
["Apoyo","Saneamiento de Activos de los Extintos ICT INURBE","P_16","Inadecuada depuración de bienes inmuebles calificados como activos","Gestión"]
["Apoyo","Saneamiento de Activos de los Extintos ICT INURBE","P_16","Perdida o deterioro de la información contenida en los archivos de gestión","Seguridad Digital"]
["Apoyo","Saneamiento de Activos de los Extintos ICT INURBE","P_16","Acceso indebido a los sistemas de información por parte del proceso de Saneamiento de activos de los extintos ICT - INURBE","Seguridad Digital"]
["Apoyo","Saneamiento de Activos de los Extintos ICT INURBE","P_16","Inadecuada supervisión en el seguimiento de la ejecución de los contratos/convenios de acuerdo a la normatividad legal vigente","Gestión"]
["Apoyo","Gestión Financiera","P_17","Posibilidad de emisión o utilización fraudulenta de titulo valor ( cheques, acciones, y depósitos judiciales) para beneficiar un tercero","Corrupción"]
["Apoyo","Gestión Financiera","P_17","Pago errado e inoportuno de las obligaciones adquiridas por la entidad","Gestión"]
["Apoyo","Gestión Financiera","P_17","Emisión de certificados de disponibilidad presupuestal CDP con rubro presupuestal diferente al indicado en la solicitud de este","Gestión"]
["Apoyo","Gestión Financiera","P_17","Omisión o registrar de manera errada la información entregada por las áreas generadoras de los hechos económicos en los estados financieros del MVCT y FONVIVIENDA","Gestión"]
["Apoyo","Gestión Financiera","P_17","Pérdida, manipulación y/o deterioro de la información contenida en los archivos de gestión de la Subdirección de Finanzas y presupuesto ","Seguridad Digital"]
["Apoyo","Gestión Financiera","P_17","Emisión errada o presentación extemporánea de los estados financieros a la Contaduría General de la Nación ","Gestión"]
["Apoyo","Gestión Financiera","P_17","Acceso indebido o alteración de la información del libro virtual de pagos","Seguridad Digital"]
["Apoyo","Gestión Financiera","P_17","Inadecuada supervisión en el seguimiento de la ejecución de los contratos/convenios de acuerdo a la normatividad legal vigente","Gestión"]
["Apoyo","Seguimiento y Mejora Continua ","P_18","Inadecuada planeación para el monitoreo y seguimiento de los instrumentos de planeación.","Corrupción"]
["Apoyo","Seguimiento y Mejora Continua ","P_18","Inadecuada implementación de los lineamientos  de monitoreo, seguimiento y mejora continua.","Gestión"]
["Apoyo","Seguimiento y Mejora Continua ","P_18","Incumplimiento del plan de acción del proceso","Gestión"]
["Apoyo","Seguimiento y Mejora Continua ","P_18","Pérdida de la información digital contenida en los instrumentos de planeación ","Seguridad Digital"]
["Apoyo","Seguimiento y Mejora Continua ","P_18","Falta de identificación de oportunidades de mejora y elementos de juicio para la toma de decisiones de líderes de proceso y la alta dirección, para mejorar la gestión institucional.","Gestión"]
["Apoyo","Seguimiento y Mejora Continua ","P_18","Pérdida o deterioro de la información contenida en los archivos de gestión del proceso de Seguimiento y Mejora Continua","Seguridad Digital"]
["Apoyo","Seguimiento y Mejora Continua ","P_18","Inadecuada supervisión en el seguimiento de la ejecución de los contratos/convenios de acuerdo a la normatividad legal vigente","Gestión"]
["Apoyo","Evaluación Independiente y Asesoría ","P_19","Posibilidad de que se oculte, distorsione o tergiverse situaciones observadas en el desarrollo de las diferentes auditorías y/o seguimientos realizados por el personal de la OCI, para beneficio de particulares.","Corrupción"]
["Apoyo","Evaluación Independiente y Asesoría ","P_19","Incumplimiento de los reportes al Representante legal, al Comité Institucional de Coordinación de Control Interno y a los organismos de inspección, vigilancia y control competentes en el marco del PAA.","Gestión"]
["Apoyo","Evaluación Independiente y Asesoría ","P_19","Brindar inadecuada asesoría y acompañamiento a los diferentes comités institucionales y/o procesos del MVCT.","Gestión"]
["Apoyo","Evaluación Independiente y Asesoría ","P_19","Pérdida o deterioro de la información contenida en los archivos de gestión.","Seguridad Digital"]
["Apoyo","Evaluación Independiente y Asesoría ","P_19","Inadecuada supervisión en el seguimiento de la ejecución de los contratos de acuerdo a la normatividad legal vigente.","Seguridad Digital"]

{"sheet":"Proyecto","index":12,"n_rows":22,"n_cols":131,"rows_kept":22,"cut":false,"hidden":true,"merged":[]}
[{"$f":"\"Py_\"&Ele_Dep_MVCT!M12","v":{"$error":"#VALUE!"}},null,"DPR-Dirección de Política y Regulación","DEUT-Dirección de Espacio Urbano y Territorial","DIVIS-Dirección de Inversiones en Vivienda de Interés Social","DM-Despacho de Ministro","DIDE-Dirección de Infraestructura y Desarrollo Empresarial","DSH-Dirección del Sistema Habitacional","DVR-Dirección de Vivienda Rural","GAUA-Grupo de Atención al Usuario y Archivo","GC-Grupo de Contratos ","GCE-Grupo de Comunicaciones Estratégicas","GCID-Grupo de Control Interno Disciplinario ","GRF-Grupo de Recursos Físicos","GTH-Grupo de Talento Humano","OAJ-Oficina Asesora Jurídica","OAP-Oficina Asesora de Planeación ","OCI-Oficina de Control Interno","OTIC-Oficina de Tecnologías de Información y Comunicaciones ","SFP-Subdirección de Finanzas y Presupuesto","SG-Secretaría General","SSA-Subdirección de Servicios Administrativos",null,null,null,null,null,null,null,null,"Proyectos de inversión",null,null,"APOYO FINANCIERO PARA FACILITAR EL ACCESO A LOS SERVICIOS DE AGUA POTABLE Y MANEJO DE AGUAS RESIDUALES A NIVEL NACIONAL",{"$f":"VLOOKUP(AH1,$AE$2:$AF$21,2,FALSE)","v":"P_I_1"},"Servicios de apoyo financiero para la ejecución de proyectos de acueductos y alcantarillado","Servicios de apoyo financiero para la ejecución de proyectos de acueductos y de manejo de aguas residuales","Servicios de apoyo financiero para proyectos de conexiones intradomiciliarias y/o agua y saneamiento en casa","DESARROLLO Y MEJORAMIENTO DEL SECTOR DE AGUA POTABLE Y SANEAMIENTO BÁSICO A NIVEL NACIONAL",{"$f":"VLOOKUP(AM1,$AE$2:$AF$21,2,FALSE)","v":"P_I_2"},"Servicio de Asistencia técnica para la formulación, implementación y seguimiento de planes, programas y proyectos de agua potable y saneamiento básico","Servicio de educación informal en regulación de Agua Potable y Saneamiento Básico","Servicios de gestión para la instrumentación técnica y normativa en agua potable y saneamiento básico","ASESORIA EN LOS PROCESOS DE CESIÓN A TÍTULO GRATUITO DE LOS BIENES INMUEBLES FISCALES URBANOS A NIVEL NACIONAL",{"$f":"VLOOKUP(AR1,$AE$2:$AF$21,2,FALSE)","v":"P_I_3"},"Servicios de asistencia técnica y jurídica en cesión a título gratuito de bienes fiscales","Servicios de apoyo para la consecución de información catastral","FORTALECIMIENTO EN LA IMPLEMENTACIÓN DE LINEAMIENTOS NORMATIVOS Y DE POLÍTICA PÚBLICA EN MATERIA DE DESARROLLO URBANO Y TERRITORIAL A NIVEL NACIONAL",{"$f":"VLOOKUP(AV1,$AE$2:$AF$21,2,FALSE)","v":"P_I_4"},"Servicios de gestión para la elaboración de instrumentos para el desarrollo urbano y territorial","Servicios de asistencia técnica en planificación urbana y ordenamiento territorial","Servicios de apoyo financiero a la ejecución de programas y proyectos de desarrollo urbano y territorial","FORTALECIMIENTO DE LAS POLÍTICAS PÚBLICAS DE VIVIENDA URBANA A NIVEL NACIONAL",{"$f":"VLOOKUP(BA1,$AE$2:$AF$21,2,FALSE)","v":"P_I_5"},"Servicios de análisis económico para el seguimiento sectorial y la toma de decisiones en la política pública de vivienda urbana","Servicios de orientación para el otorgamiento de subsidio familiar de vivienda","Servicios de formulación einstrumentaciónde las políticas públicas de vivienda urbana","Servicios de apoyo para la implementación y seguimiento de la política pública de vivienda urbana para la población víctima de desplazamiento forzado","Servicios de asistencia técnica y administrativa para la formulación e implementación de proyectos de vivienda urbana","SANEAMIENTO Y LEGALIZACIÓN DE LOS BIENES INMUEBLES DE LOS EXTINTOS ICT-INURBE A NIVEL NACIONAL",{"$f":"VLOOKUP(BH1,$AE$2:$AF$21,2,FALSE)","v":"P_I_6"},"Servicios de información para la gestión predial de los bienes inmuebles de los extintos ICT-INURBE","Servicios de asistencia técnica y jurídica para el saneamiento, legalización y comercialización de bienes inmuebles de los extintos ICT-INURBE","Servicios de saneamiento y legalización de los bienes inmuebles de los extintos ICT-INURBE","FORTALECIMIENTO DE LAS CAPACIDADES ESTRATÉGICAS Y DE APOYO DEL MINISTERIO DE VIVIENDA, CIUDAD Y TERRITORIO A NIVEL NACIONAL",{"$f":"VLOOKUP(BM1,$AE$2:$AF$21,2,FALSE)","v":"P_I_7"},"Sedes adecuadas","Servicios de formación para el trabajo y desarrollo humano","Servicios de comunicación","Servicio de atención al ciudadano","Servicio de gestión documental","Servicio de gestión de calidad","FORTALECIMIENTO A LA PRESTACIÓN DE LOS SERVICIOS PÚBLICOS DE ACUEDUCTO, ALCANTARILLADO Y ASEO EN EL DEPARTAMENTO DE LA GUAJIRA. LA GUAJIRA",{"$f":"VLOOKUP(BU1,$AE$2:$AF$21,2,FALSE)","v":"P_I_8"},"Servicio de asistencia técnica para la estructuración, formulación yejecución de planes y proyectos de agua potable y saneamiento básico","Servicio de administración de recursos del Sistema General de Participación para los municipios descertificados","SANEAMIENTO DE VERTIMIENTOS EN CUENCAS PRIORIZADAS DEL TERRITORIO NACIONAL",{"$f":"VLOOKUP(BY1,$AE$2:$AF$21,2,FALSE)","v":"P_I_9"},"Servicio de apoyo técnico para el tratamiento de aguas residuales","Servicio de apoyo financiero en tratamiento de aguas residuales","FORTALECIMIENTO DE LAS TECNOLOGÍAS DE LA INFORMACIÓN Y LAS COMUNICACIONES EN EL MINISTERIO DE VIVIENDA, CIUDAD Y TERRITORIO A NIVEL NACIONAL",{"$f":"VLOOKUP(CC1,$AE$2:$AF$21,2,FALSE)","v":"P_I_10"},"Servicios de información para la gestión administrativa","FORTALECIMIENTO DE LA ACTIVIDAD DE MONITOREO A LOS RECURSOS DEL SGP-APSB Y LA ASISTENCIA TÉCNICA DE LAS ENTIDADES TERRITORIALES A NIVEL NACIONAL",{"$f":"VLOOKUP(CF1,$AE$2:$AF$21,2,FALSE)","v":"P_I_11"},"Servicio asistencia técnica en el monitoreo a los recursos Sistema General de Participaciones SGP - Agua Potable y Saneamiento Básico","Servicio de apoyo a la estrategia de monitoreo, seguimiento y control a los recursos del Sistema General de Participaciones SGP - Agua Potable y Saneamiento Básico","AMPLIACIÓN Y MEJORAMIENTO DE GESTIÓN INTEGRAL DE RESIDUOS SÓLIDOS EN EL TERRITORIO NACIONAL",{"$f":"VLOOKUP(CJ1,$AE$2:$AF$21,2,FALSE)","v":"P_I_12"},"Servicio de apoyo técnico a la gestión integral de residuos sólidos","Servicios de apoyo financiero para la ejecución de proyectos de gestión integral de residuos sólidos","FORTALECIMIENTO DE LA GESTIÓN JURÍDICA DEL MINISTERIO DE VIVIENDA, CIUDAD Y TERRITORIO A NIVEL NACIONAL",{"$f":"VLOOKUP(CN1,$AE$2:$AF$21,2,FALSE)","v":"P_I_13"},"Servicio de asesoría jurídica","Servicios de Defensa Judicial  y extrajudicial","APOYO FINANCIERO PARA LA IMPLEMENTACIÓN DEL PLAN MAESTRO DE ALCANTARILLADO DEL MUNICIPIO DE MOCOA",{"$f":"VLOOKUP(CR1,$AE$2:$AF$21,2,FALSE)","v":"P_I_14"},"Servicios de apoyo financiero para la ejecución de proyectos de acueductos y alcantarillado","Servicio de asistencia técnica para la estructuración, formulación yejecución de planes y proyectos de agua potable y saneamiento básico","Apoyo financiero al plan de inversiones en infraestructura para fortalecer la prestación de los servicios de acueducto y alcantarillado en el municipio de Santiago de Cali",{"$f":"VLOOKUP(CV1,$AE$2:$AF$21,2,FALSE)","v":"P_I_15"},"Servicios de apoyo financiero para la ejecución de proyectos de acueductos y alcantarillado","Implementación del programa de cobertura condicionada para créditos de vivienda segunda generación Nacional",{"$f":"VLOOKUP(CY1,$AE$2:$AF$21,2,FALSE)","v":"P_I_16"},"Servicio de apoyo financiero para adquisición de vivienda","Servicio de apoyo financiero para mejoramiento de vivienda","Servicio de apoyo financiero para construcción de vivienda en sitio propio","Subsidio Familiar de Vivienda Nacional",{"$f":"VLOOKUP(DD1,$AE$2:$AF$21,2,FALSE)","v":"P_I_17"},"Servicio de apoyo financiero para adquisición de vivienda","Servicio de apoyo financiero para mejoramiento de vivienda","Servicio de apoyo financiero para arrendamiento de vivienda","Servicio de apoyo financiero para construcción de vivienda en sitio propio","Servicio de apoyo financiero para la asignación de subsidios por sentencias judiciales","Servicio de apoyo a la ejecución de la política de vivienda","Servicio de  Información implementado","Fortalecimiento de los procesos de producción de vivienda Nacional",{"$f":"VLOOKUP(DM1,$AE$2:$AF$21,2,FALSE)","v":"P_I_18"},"Servicios de asistencia técnica en procesos de producción de vivienda","Documentos de lineamientos técnicos","Fortalecimiento a la formulación e implementación de la política de vivienda rural - Nacional",{"$f":"VLOOKUP(DQ1,$AE$2:$AF$21,2,FALSE)","v":"P_I_19"},"Servicio de asistencia técnica para la formulación e implementación de la política de vivienda rural","Documentos normativos","Implementación del Programa de agua potable y alcantarillado para el departamento de La Guajira",{"$f":"VLOOKUP(DU1,$AE$2:$AF$21,2,FALSE)","v":"P_I_20"},"Servicios de apoyo financiero para la ejecución de proyectos de acueductos y alcantarillado","Servicio de Asistencia técnica para la formulación, implementación y seguimiento de planes, programas y proyectos de agua potable y saneamiento básico","Fortalecimiento a la construcción de equipamientos en los programas de vivienda de interés prioritario y social Nacional",{"$f":"VLOOKUP(DY1,$AE$2:$AF$22,2,FALSE)","v":"P_I_21"},"Servicio de apoyo financiero para la construcción de equipamientos"]
[1,null,"DESARROLLO Y MEJORAMIENTO DEL SECTOR DE AGUA POTABLE Y SANEAMIENTO BÁSICO A NIVEL NACIONAL","FORTALECIMIENTO EN LA IMPLEMENTACIÓN DE LINEAMIENTOS NORMATIVOS Y DE POLÍTICA PÚBLICA EN MATERIA DE DESARROLLO URBANO Y TERRITORIAL A NIVEL NACIONAL","FORTALECIMIENTO DE LAS POLÍTICAS PÚBLICAS DE VIVIENDA URBANA A NIVEL NACIONAL","FORTALECIMIENTO DE LAS CAPACIDADES ESTRATÉGICAS Y DE APOYO DEL MINISTERIO DE VIVIENDA, CIUDAD Y TERRITORIO A NIVEL NACIONAL","APOYO FINANCIERO PARA FACILITAR EL ACCESO A LOS SERVICIOS DE AGUA POTABLE Y MANEJO DE AGUAS RESIDUALES A NIVEL NACIONAL","ASESORIA EN LOS PROCESOS DE CESIÓN A TÍTULO GRATUITO DE LOS BIENES INMUEBLES FISCALES URBANOS A NIVEL NACIONAL","Fortalecimiento a la formulación e implementación de la política de vivienda rural - Nacional","FORTALECIMIENTO DE LAS CAPACIDADES ESTRATÉGICAS Y DE APOYO DEL MINISTERIO DE VIVIENDA, CIUDAD Y TERRITORIO A NIVEL NACIONAL","FORTALECIMIENTO DE LAS CAPACIDADES ESTRATÉGICAS Y DE APOYO DEL MINISTERIO DE VIVIENDA, CIUDAD Y TERRITORIO A NIVEL NACIONAL","FORTALECIMIENTO DE LAS CAPACIDADES ESTRATÉGICAS Y DE APOYO DEL MINISTERIO DE VIVIENDA, CIUDAD Y TERRITORIO A NIVEL NACIONAL","FORTALECIMIENTO DE LAS CAPACIDADES ESTRATÉGICAS Y DE APOYO DEL MINISTERIO DE VIVIENDA, CIUDAD Y TERRITORIO A NIVEL NACIONAL","FORTALECIMIENTO DE LAS CAPACIDADES ESTRATÉGICAS Y DE APOYO DEL MINISTERIO DE VIVIENDA, CIUDAD Y TERRITORIO A NIVEL NACIONAL","FORTALECIMIENTO DE LAS CAPACIDADES ESTRATÉGICAS Y DE APOYO DEL MINISTERIO DE VIVIENDA, CIUDAD Y TERRITORIO A NIVEL NACIONAL","FORTALECIMIENTO DE LA GESTIÓN JURÍDICA DEL MINISTERIO DE VIVIENDA, CIUDAD Y TERRITORIO A NIVEL NACIONAL","FORTALECIMIENTO DE LAS CAPACIDADES ESTRATÉGICAS Y DE APOYO DEL MINISTERIO DE VIVIENDA, CIUDAD Y TERRITORIO A NIVEL NACIONAL",null,"FORTALECIMIENTO DE LAS TECNOLOGÍAS DE LA INFORMACIÓN Y LAS COMUNICACIONES EN EL MINISTERIO DE VIVIENDA, CIUDAD Y TERRITORIO A NIVEL NACIONAL","FORTALECIMIENTO DE LAS CAPACIDADES ESTRATÉGICAS Y DE APOYO DEL MINISTERIO DE VIVIENDA, CIUDAD Y TERRITORIO A NIVEL NACIONAL",null,"SANEAMIENTO Y LEGALIZACIÓN DE LOS BIENES INMUEBLES DE LOS EXTINTOS ICT-INURBE A NIVEL NACIONAL",null,null,null,null,null,null,null,null,"APOYO FINANCIERO PARA FACILITAR EL ACCESO A LOS SERVICIOS DE AGUA POTABLE Y MANEJO DE AGUAS RESIDUALES A NIVEL NACIONAL","P_I_1","A","Servicios de apoyo financiero para la ejecución de proyectos de acueductos y alcantarillado",{"$f":"$AI$1&AG2","v":"P_I_1A"},"Asignar el apoyo financiero a los proyectos viabilizados de acueducto y alcantarillado en el área urbana, en el marco de la normatividad vigente.","Asignar apoyo financiero y de soporte técnico a proyectos de acueducto y alcantarillado en el área Rural, en el marco de la normatividad vigente","Asignar el apoyo financiero a los proyectos de conexiones intradomiciliarias viabilizados conforme a la normatividad","Servicio de Asistencia técnica para la formulación, implementación y seguimiento de planes, programas y proyectos de agua potable y saneamiento básico",{"$f":"$AN$1&AG2","v":"P_I_2A"},"Apoyar las gestiones operativas y administrativas para la prestación de los servicios del Viceministerio","Desarrollar los espacios de concertación y socialización de los lineamientos en agua potable y saneamiento básico","Proyectar las propuestas de instrumentos normativos para el sector","Servicios de asistencia técnica y jurídica en cesión a título gratuito de bienes fiscales",{"$f":"$AS$1&AG2","v":"P_I_3A"},"Apoyar las gestiones operativas y administrativas para la prestación de los servicios del proceso de cesión a título gratuito","Gestionar la consecución de la información catastral necesaria para los procesos de cesión a título gratuito","Servicios de gestión para la elaboración de instrumentos para el desarrollo urbano y territorial",{"$f":"$AW$1&AG2","v":"P_I_4A"},"Elaborar las herramientas necesarias para la orientación de los procesos de desarrollo urbano y territorial","Apoyar las gestiones operativas y administrativas para la prestación de servicios de asistencia técnica en desarrollo urbano y territorial","Proveer los servicios y recursos financieros necesarios para apoyar el desarrollo de los proyectos","Servicios de análisis económico para el seguimiento sectorial y la toma de decisiones en la política pública de vivienda urbana",{"$f":"$BB$1&AG2","v":"P_I_5A"},"Apoyar las gestiones operativas y administrativas para la prestación del servicio de análisis y seguimiento económico de la política de vivienda urbana","Apoyar las gestiones operativas y administrativas en los procesos de asignación del subsidio familiar de vivienda","Apoyar las gestiones administrativas y operativas para la generación de políticas e instrumentos normativos en materia de vivienda urbana","Apoyar las gestiones operativas y administrativas para la participación en los espacios a los que sea convocado el Ministerio o FONVIVIENDA en materia de la política pública de vivienda urbana para población víctima de desplazamiento forzado","Apoyar las gestiones operativas y administrativas para la implementación de proyectos de vivienda urbana","Servicios de información para la gestión predial de los bienes inmuebles de los extintos ICT-INURBE",{"$f":"$BI$1&AG2","v":"P_I_6A"},"Actualizar el modelo funcional del sistema de información de los bienes inmuebles de los extintos ICT-INURBE","Apoyar las gestiones operativas y administrativas para la prestación de los servicios para el saneamiento y legalización de los bienes inmuebles de los extintos ICT-INURBE","Adquirir la información predial, catastral y registral necesaria para adelantar el saneamiento y legalización de los bienes inmuebles de los extintos ICT-INURBE","Sedes adecuadas",{"$f":"$BN$1&AG2","v":"P_I_7A"},"Desarrollar las actividades de adecuación, ampliación, mejoramiento y mantenimiento mayor de la infraestructura de acuerdo con las necesidades de la Entidad","Evaluar los resultados del Plan Institucional de Capacitación","Construir la estrategia de comunicación externa e interna","Orientar a los actores involucrados sobre temas de servicio al ciudadano y gestión documental","Implementar los procesos de gestión documental necesarios para la operación del ministerio","Apoyar las gestiones operativas y administrativas necesarias para el desarrollo de los procesos","Servicio de asistencia técnica para la estructuración, formulación yejecución de planes y proyectos de agua potable y saneamiento básico",{"$f":"$BV$1&AG2","v":"P_I_8A"},"Apoyar en la gestión jurídica y administrativa requerida para la ejecución de la asuncion temporal","Apoyar las labores de administración de los recursos del Sistema General de Participación para municipios descertificados","Servicio de apoyo técnico para el tratamiento de aguas residuales",{"$f":"$BZ$1&AG2","v":"P_I_9A"},"Apoyar las gestiones operativas y administrativas para la gestión del saneamiento de vertimientos","Asignar el apoyo financiero a los proyectos viabilizados para la gestión del tratamiento de aguas residuales","Servicios de información para la gestión administrativa",{"$f":"$CD$1&AG2","v":"P_I_10A"},"Adquirir y desarrollar software de acuerdo a los requerimientos de la Entidad para llevar a cabo sus labores misionales, estratégicas y de apoyo","Servicio asistencia técnica en el monitoreo a los recursos Sistema General de Participaciones SGP - Agua Potable y Saneamiento Básico",{"$f":"$CG$1&AG2","v":"P_I_11A"},"Apoyar las gestiones administrativas y operativas para realizar acompañamiento a las Entidades territoriales en monitoreo a los recursos SGP-APSB y proceso de certificación","Formular, expedir y revisar los instrumentos técnicos y normativos relacionados con monitoreo de los recursos del SGP-APSB","Servicio de apoyo técnico a la gestión integral de residuos sólidos",{"$f":"$CK$1&AG2","v":"P_I_12A"},"Elaborar instrumentos técnicos para la generación y/o transferencia de conocimiento en la gestión integral de residuos sólidos","Asignar el apoyo financiero a los proyectos viabilizados para la gestión integral de residuos sólidos","Servicio de asesoría jurídica",{"$f":"$CO$1&AG2","v":"P_I_13A"},"Actualizar las competencias y conocimientos del área de trabajo conforme a las dinámicas en la normatividad, la doctrina y la jurisprudencia del sector","Actualizar la Información Relacionada con las Actuaciones jurídicas de la OAJ","Servicios de apoyo financiero para la ejecución de proyectos de acueductos y alcantarillado",{"$f":"$CS$1&AG2","v":"P_I_14A"},"Apoyar financieramente el proyecto de preinversión para el mejoramiento del sistema de alcantarillado","Apoyar las gestiones operativas y administrativas para la prestación de los servicios requeridos","Servicios de apoyo financiero para la ejecución de proyectos de acueductos y alcantarillado",{"$f":"$CW$1&AG2","v":"P_I_15A"},"Asignar el apoyo financiero a los proyectos viabilizados de acueducto y alcantarillado, en el marco de la normatividad vigente.","Servicio de apoyo financiero para adquisición de vivienda",{"$f":"$CZ$1&AG2","v":"P_I_16A"},"Realizar el pago de recursos a Banco de la República para el pago de coberturas otorgadas para vivienda de interés social y Prioritario","Realizar el pago de recursos a Banco de la República para el pago de coberturas otorgadas para vivienda de interés social y Prioritario","Realizar el pago de recursos a Banco de la República para el pago de coberturas otorgadas para vivienda de interés social y Prioritario","Servicio de apoyo financiero para adquisición de vivienda",{"$f":"$DE$1&AG2","v":"P_I_17A"},"Transferir recursos a entidades publicas o privadas para la administración y pago de los subsidios","Transferir recursos a entidades públicas o privadas para la administración y pago de los subsidios","Transferir recursos a entidades públicas o privadas para la administración y pago de los subsidios","Transferir recursos a entidades públicas o privadas para la administración y pago de los subsidios","Asignar subsidio para tutelas","Apoyar las gestiones operativas, administrativas y de seguimiento relacionadas con el proceso de asignación el Subsidio Familiar de Vivienda","Transferir recursos a los patrimonios autonomos para la administración y pago de los subsidios","Servicios de asistencia técnica en procesos de producción de vivienda",{"$f":"$DN$1&AG2","v":"P_I_18A"},"Apoyar las gestiones operativas y administrativas para la implementación de los servicios de asistencia técnica","Apoyar las gestiones operativas y administrativas para la generación de documentos de lineamientos técnicos sobre los procesos constructivos de producción de vivienda social","Servicio de asistencia técnica para la formulación e implementación de la política de vivienda rural",{"$f":"$DR$1&AG2","v":"P_I_19A"},"Realizar asistencia técnica a los actores involucrados en las políticas, planes, programas y proyectos de vivienda rural","Diseñar la pólitica pública de vivienda rural e impulsar mejoras en su ejecución","Servicios de apoyo financiero para la ejecución de proyectos de acueductos y alcantarillado",{"$f":"$DV$1&AG2","v":"P_I_20A"},"Apoyar financieramente el proyecto de preinversión para el mejoramiento del sistema de acueducto y alcantarillado","Realizar asistencia administrativa, técnica, jurídica y financiera para la revisión, evaluación y seguimiento a los planes, programas y proyectos de agua potable y saneamiento básico","Servicio de apoyo financiero para la construcción de equipamientos",{"$f":"$DZ$1&AG2","v":"P_I_21A"},"Transferir recursos a entidades públicas o privadas para la administración y pago de los equipamientos"]
[2,null,"FORTALECIMIENTO A LA PRESTACIÓN DE LOS SERVICIOS PÚBLICOS DE ACUEDUCTO, ALCANTARILLADO Y ASEO EN EL DEPARTAMENTO DE LA GUAJIRA. LA GUAJIRA",null,"Implementación del programa de cobertura condicionada para créditos de vivienda segunda generación Nacional",null,"APOYO FINANCIERO PARA LA IMPLEMENTACIÓN DEL PLAN MAESTRO DE ALCANTARILLADO DEL MUNICIPIO DE MOCOA","FORTALECIMIENTO DE LAS POLÍTICAS PÚBLICAS DE VIVIENDA URBANA A NIVEL NACIONAL",null,null,null,null,null,null,null,null,null,null,null,null,null,"FORTALECIMIENTO DE LAS CAPACIDADES ESTRATÉGICAS Y DE APOYO DEL MINISTERIO DE VIVIENDA, CIUDAD Y TERRITORIO A NIVEL NACIONAL",null,null,null,null,null,null,null,null,"DESARROLLO Y MEJORAMIENTO DEL SECTOR DE AGUA POTABLE Y SANEAMIENTO BÁSICO A NIVEL NACIONAL","P_I_2","B","Servicios de apoyo financiero para la ejecución de proyectos de acueductos y de manejo de aguas residuales",{"$f":"$AI$1&AG3","v":"P_I_1B"},"Realizar seguimiento a los proyectos de acueducto y alcantarillado del área urbana apoyados financieramente","Realizar seguimiento a los proyectos de acueducto y alcantarillado del área rural apoyados financieramente","Realizar seguimiento a los proyectos de conexiones intradomiciliarias apoyados financieramente","Servicio de educación informal en regulación de Agua Potable y Saneamiento Básico",{"$f":"$AN$1&AG3","v":"P_I_2B"},"Realizar asistencia técnica, revisión, evaluación y seguimiento a los planes, programas y proyectos de agua potable y saneamiento básico presentados al Ministerio","Elaborar instrumentos de divulgación de los servicios que brinda el Viceministerio","Realizar estudios y consultorías sectoriales","Servicios de apoyo para la consecución de información catastral",{"$f":"$AS$1&AG3","v":"P_I_3B"},"Prestar los servicios de asistencia técnica y jurídica","Priorizar los predios susceptibles de cesión a título gratuito de bienes fiscales","Servicios de asistencia técnica en planificación urbana y ordenamiento territorial",{"$f":"$AW$1&AG3","v":"P_I_4B"},"Elaborar los instrumentos normativos y de política en materia de desarrollo urbano y territorial","Brindar asistencia técnica para el desarrollo urbano y territorial","Realizar las labores de supervisión de los proyectos","Servicios de orientación para el otorgamiento de subsidio familiar de vivienda",{"$f":"$BB$1&AG3","v":"P_I_5B"},"Elaborar estudios económicos, diagnósticos y otros documentos que sirvan de apoyo para la formulación, ejecución, seguimiento y divulgación de la política pública de vivienda urbana y el comportamiento sectorial","Brindar orientación durante los procesos de asignación del subsidio familiar de vivienda","Elaborar políticas e instrumentos normativos en materia de vivienda urbana","Apoyar técnica y jurídicamente al Viceministerio de Vivienda en las actividades relacionadas con la implementación y seguimiento de la política pública de vivienda urbana para la población víctima de desplazamiento forzado","Realizar la asesoría, acompañamiento técnico, revisión y seguimiento a los proyectos de vivienda urbana","Servicios de asistencia técnica y jurídica para el saneamiento, legalización y comercialización de bienes inmuebles de los extintos ICT-INURBE",{"$f":"$BI$1&AG3","v":"P_I_6B"},"Revisar y actualizar la información que contiene el sistema de información","Prestar los servicios de apoyo técnico y jurídico para el saneamiento de bienes inmuebles activos fiscales que estuvieron a cargo de las entidades extintas, a través de la Subdirección de Servicios Administrativos del MVCT, según la normatividad vigente para lograr la comercialización ante CISA S.A, la transferencias de bienes institucionales, para lograr la depuración de los registros.","Gestionar la identifiación de los bienes inmuebles para adelantar el saneamiento y legalización.","Servicios de formación para el trabajo y desarrollo humano",{"$f":"$BN$1&AG3","v":"P_I_7B"},"Realizar las actividades de interventoría a las intervenciones de infraestructura","Prestar los servicios de educación y capacitación contemplados en el Plan Institucional de Capacitación","Elaborar e implementar los productos comunicacionales","Tramitar las peticiones y/o consultas ciudadanas","Realizar las labores de archivo y preservación de documentos","Apoyar las gestiones transversales de la Entidad para la toma de decisiones administrativas y del alto nivel","Servicio de administración de recursos del Sistema General de Participación para los municipios descertificados",{"$f":"$BV$1&AG3","v":"P_I_8B"},"Apoyar las gestiones operativas y administrativas para la prestación de los servicios necesarios por el administrador temporal","Realizar las actividades correspondientes al seguimiento del proyecto y reporte de información al FUT y SUI","Servicio de apoyo financiero en tratamiento de aguas residuales",{"$f":"$BZ$1&AG3","v":"P_I_9B"},"Elaborar instrumentos técnicos para la generación de conocimiento en la gestión del tratamiento de aguas residuales","Realizar seguimiento los proyectos apoyados financieramente",null,null,"Apoyar las gestiones operativas y administrativas para la prestación de los servicios de TIC en el Ministerio","Servicio de apoyo a la estrategia de monitoreo, seguimiento y control a los recursos del Sistema General de Participaciones SGP - Agua Potable y Saneamiento Básico",{"$f":"$CG$1&AG3","v":"P_I_11B"},"Brindar acompañamiento a las Entidades Territoriales en el monitoreo a los recursos SGP-APSB y proceso de certificación","Levantar información técnica y jurídica necesaria para la formulación de los instrumentos normativos","Servicios de apoyo financiero para la ejecución de proyectos de gestión integral de residuos sólidos",{"$f":"$CK$1&AG3","v":"P_I_12B"},"Realizar los estudios especializados en GIRS .","Realizar seguimiento los proyectos apoyados financieramente","Servicios de Defensa Judicial  y extrajudicial",{"$f":"$CO$1&AG3","v":"P_I_13B"},"Atender las Consultas y Reclamaciones de competencia de a Ofician Asesora Jurídica","Apoyar las gestiones operativas y administrativas relacionadas con la gestión jurídica de la entidad","Servicio de asistencia técnica para la estructuración, formulación yejecución de planes y proyectos de agua potable y saneamiento básico",{"$f":"$CS$1&AG3","v":"P_I_14B"},"Apoyar financieramente la construcción para la optimización del sistema de alcantarillado","Realizar asistencia Administrativa, técnica, jurídica y financiera para la revisión, evaluación y seguimiento a los planes, programas y proyectos de saneamiento básico presentados al Ministerio",null,null,"Realizar seguimiento a los proyectos de acueducto y alcantarillado apoyados financieramente","Servicio de apoyo financiero para mejoramiento de vivienda",{"$f":"$CZ$1&AG3","v":"P_I_16B"},null,null,null,"Servicio de apoyo financiero para mejoramiento de vivienda",{"$f":"$DE$1&AG3","v":"P_I_17B"},null,null,null,null,null,null,null,"Documentos de lineamientos técnicos",{"$f":"$DN$1&AG3","v":"P_I_18B"},"Realizar la asistencia técnica a las entidades del SNVIS","Elaborar estudios económicos, diagnósticos y otros documentos que sirvan de insumo para la toma de decisiones sobre los procesos constructivos de producción de vivienda social","Documentos normativos",{"$f":"$DR$1&AG3","v":"P_I_19B"},"Apoyar las gestiones administrativas y operativas para el seguimiento de la implementacion de la política de vivienda rural","Realizar un análisis de focalización de las inversiones y establecer los lineamientos técnicos y tipologías de vivienda","Servicio de Asistencia técnica para la formulación, implementación y seguimiento de planes, programas y proyectos de agua potable y saneamiento básico",{"$f":"$DV$1&AG3","v":"P_I_20B"},"Apoyar financieramente el proyecto de inversión para el mejoramiento del sistema de acueducto y alcantarillado","Apoyar las gestiones operativas y administrativas para la prestación de los servicios requeridos"]
[3,null,"SANEAMIENTO DE VERTIMIENTOS EN CUENCAS PRIORIZADAS DEL TERRITORIO NACIONAL",null,"Subsidio Familiar de Vivienda Nacional",null,"Apoyo financiero al plan de inversiones en infraestructura para fortalecer la prestación de los servicios de acueducto y alcantarillado en el municipio de Santiago de Cali","SANEAMIENTO Y LEGALIZACIÓN DE LOS BIENES INMUEBLES DE LOS EXTINTOS ICT-INURBE A NIVEL NACIONAL",null,null,null,null,null,null,null,null,null,null,null,null,null,null,null,null,null,null,null,null,null,null,"ASESORIA EN LOS PROCESOS DE CESIÓN A TÍTULO GRATUITO DE LOS BIENES INMUEBLES FISCALES URBANOS A NIVEL NACIONAL","P_I_3","C","Servicios de apoyo financiero para proyectos de conexiones intradomiciliarias y/o agua y saneamiento en casa","P_I_1C",null,null,null,"Servicios de gestión para la instrumentación técnica y normativa en agua potable y saneamiento básico","P_I_2C",null,"Realizar la divulgación en los temas relacionados con agua potable y saneamiento básico",null,null,null,null,null,"Servicios de apoyo financiero a la ejecución de programas y proyectos de desarrollo urbano y territorial","P_I_4C","Realizar los estudios e investigaciones para el apoyo a los procesos de desarrollo urbano y territorial","Elaborar diagnósticos, proyectos y/o evaluaciones en temas de desarrollo urbano y territorial",null,"Servicios de formulación einstrumentaciónde las políticas públicas de vivienda urbana","P_I_5C","Obtener información económica relevante para la formulación e implementación de la política pública de vivienda urbana","Realizar acompañamiento social a los beneficiarios del subsidio familiar de vivienda","Socializar, publicar y/o divulgar las políticas e instrumentos normativos de vivienda urbana, en sus diferentes etapas.",null,"Realizar seguimiento y control de los recursos destinados a subsidios familiar de vivienda","Servicios de saneamiento y legalización de los bienes inmuebles de los extintos ICT-INURBE","P_I_6C",null,"Prestar los servicios de apoyo técnico y jurídico para la gestión de todos los procesos y procedimientos que corresponden a los inmuebles sujetos a saneamiento y legalización del extinto ICT/INURBE","Realizar avalúos comerciales y levantamientos topográficos","Servicios de comunicación","P_I_7C","Realizar los estudios y diseños para la intervención de la infraestructura",null,null,null,null,"Apoyar los procesos de planeación estratégica y gestión de recursos financieros",null,null,"Asistir al departamento en la formulación, estructuración y ejecución de los planes y proyectos de Agua Potable y Saneamiento básico",null,null,null,"Realizar los estudios especializados en saneamiento de vertimientos",null,null,null,"Brindar los servicios de gestión de capacidad de TI",null,null,"Elaborar y actualizar las guías metodológicas relacionadas con el monitoreo de los recursos del SGP-APSB y proceso de certificación","Realizar monitoreo a los recursos del SGP-APSB de las entidades territoriales",null,null,null,null,null,null,"Elaborar y revisar los proyectos normativos, contratos y o convenios relacionados con el sector.","Atender de forma articulada los requerimientos jurídicos de la entidad",null,null,null,null,null,null,null,"Servicio de apoyo financiero para construcción de vivienda en sitio propio","P_I_16C",null,null,null,"Servicio de apoyo financiero para arrendamiento de vivienda","P_I_17C",null,null,null,null,null,null,null,null,null,null,"Obtener información económica para el seguimiento y la evaluación de los procesos constructivos de producción de vivienda social",null,null,null,"Apoyar las gestiones administrativas y operativas para la formulación de la política de vivienda rural"]
[4,null,"FORTALECIMIENTO DE LA ACTIVIDAD DE MONITOREO A LOS RECURSOS DEL SGP-APSB Y LA ASISTENCIA TÉCNICA DE LAS ENTIDADES TERRITORIALES A NIVEL NACIONAL",null,"Fortalecimiento a la construcción de equipamientos en los programas de vivienda de interés prioritario y social Nacional",null,"Implementación del Programa de agua potable y alcantarillado para el departamento de La Guajira","Fortalecimiento de los procesos de producción de vivienda Nacional",null,null,null,null,null,null,null,null,null,null,null,null,null,null,null,null,null,null,null,null,null,null,"FORTALECIMIENTO EN LA IMPLEMENTACIÓN DE LINEAMIENTOS NORMATIVOS Y DE POLÍTICA PÚBLICA EN MATERIA DE DESARROLLO URBANO Y TERRITORIAL A NIVEL NACIONAL","P_I_4","D",null,null,null,null,null,null,null,null,null,null,null,null,null,null,null,null,null,"Emitir conceptos técnicos sobre desarrollo urbano y territorial",null,"Servicios de apoyo para la implementación y seguimiento de la política pública de vivienda urbana para la población víctima de desplazamiento forzado","P_I_5D",null,null,null,null,null,null,null,null,null,"Realizar el pago de las obligaciones tributarias, fiscales y administrativas de los bienes inmuebles activos","Servicio de atención al ciudadano","P_I_7D",null,null,null,null,null,"Realizar actividades dirigidas a la prevención e investigación y sanción de faltas disciplinarias",null,null,null,null,null,null,null,null,null,null,"Brindar servicios de soporte y operación",null,null,null,null,null,null,null,null,null,null,"Obtener información jurídica relevante para la gestión jurídica","Ejercer la Vigilancia Judicial de la actividad Litigiosa",null,null,null,null,null,null,null,null,null,null,null,null,"Servicio de apoyo financiero para construcción de vivienda en sitio propio","P_I_17D"]
[5,null,"AMPLIACIÓN Y MEJORAMIENTO DE GESTIÓN INTEGRAL DE RESIDUOS SÓLIDOS EN EL TERRITORIO NACIONAL",null,null,null,null,null,null,null,null,null,null,null,null,null,null,null,null,null,null,null,null,null,null,null,null,null,null,null,"FORTALECIMIENTO DE LAS POLÍTICAS PÚBLICAS DE VIVIENDA URBANA A NIVEL NACIONAL","P_I_5","E",null,null,null,null,null,null,null,null,null,null,null,null,null,null,null,null,null,null,null,"Servicios de asistencia técnica y administrativa para la formulación e implementación de proyectos de vivienda urbana","P_I_5E",null,null,null,null,null,null,null,null,null,null,"Servicio de gestión documental","P_I_7E",null,null,null,null,null,"Realizar evaluación, seguimiento y control en el marco del Sistema de Control Interno",null,null,null,null,null,null,null,null,null,null,"Diseñar e implementar el sistema de gestión de la seguridad de la información",null,null,null,null,null,null,null,null,null,null,null,"Representar judicial y extrajudicialmente al Ministerio, Fonvivienda e INURBE en los procesos en que sea parte",null,null,null,null,null,null,null,null,null,null,null,null,"Servicio de apoyo financiero para la asignación de subsidios por sentencias judiciales","P_I_17E"]
[6,null,null,null,null,null,null,null,null,null,null,null,null,null,null,null,null,null,null,null,null,null,null,null,null,null,null,null,null,null,"SANEAMIENTO Y LEGALIZACIÓN DE LOS BIENES INMUEBLES DE LOS EXTINTOS ICT-INURBE A NIVEL NACIONAL","P_I_6","F",null,null,null,null,null,null,null,null,null,null,null,null,null,null,null,null,null,null,null,null,null,null,null,null,null,null,null,null,null,null,null,"Servicio de gestión de calidad","P_I_7F",null,null,null,null,null,null,null,null,null,null,null,null,null,null,null,null,"Dotar de infraestructura tecnológica al Ministerio",null,null,null,null,null,null,null,null,null,null,null,null,null,null,null,null,null,null,null,null,null,null,null,null,"Servicio de apoyo a la ejecución de la política de vivienda","P_I_17F"]
[7,{"$f":"IFERROR(VLOOKUP('FORMATO PAI'!F26,Proyecto!$AE$1:$AF$21,2,FALSE),\"\")","v":""},null,null,null,null,null,null,null,null,null,null,null,null,null,null,null,null,null,null,null,null,null,null,null,null,null,null,null,null,"FORTALECIMIENTO DE LAS CAPACIDADES ESTRATÉGICAS Y DE APOYO DEL MINISTERIO DE VIVIENDA, CIUDAD Y TERRITORIO A NIVEL NACIONAL","P_I_7","G",null,null,null,null,null,null,null,null,null,null,null,null,null,null,null,null,null,null,null,null,null,null,null,null,null,null,null,null,null,null,null,null,null,null,null,null,null,null,null,null,null,null,null,null,null,null,null,null,null,"Formular políticas, manuales y protocolos de gestión de TI",null,null,null,null,null,null,null,null,null,null,null,null,null,null,null,null,null,null,null,null,null,null,null,null,"Servicio de  Información implementado","P_I_17G"]
[8,{"$f":"IFERROR(VLOOKUP('FORMATO PAI'!F27,Proyecto!$AE$1:$AF$21,2,FALSE),\"\")","v":""},null,null,null,null,null,null,null,null,null,null,null,null,null,null,null,null,null,null,null,null,null,null,null,null,null,null,null,null,"FORTALECIMIENTO A LA PRESTACIÓN DE LOS SERVICIOS PÚBLICOS DE ACUEDUCTO, ALCANTARILLADO Y ASEO EN EL DEPARTAMENTO DE LA GUAJIRA. LA GUAJIRA","P_I_8","H",null,null,null,null,null,null,null,null,null,null,null,null,null,null,null,null,null,null,null,null,null,null,null,null,null,null,null,null,null,null,null,null,null,null,null,null,null,null,null,null,null,null,null,null,null,null,null,null,null,"Realizar actualizaciones y mantenimiento de software"]
[9,{"$f":"IFERROR(VLOOKUP('FORMATO PAI'!F28,Proyecto!$AE$1:$AF$21,2,FALSE),\"\")","v":""},null,null,null,null,null,null,null,null,null,null,null,null,null,null,null,null,null,null,null,null,null,null,null,null,null,null,null,null,"SANEAMIENTO DE VERTIMIENTOS EN CUENCAS PRIORIZADAS DEL TERRITORIO NACIONAL","P_I_9","I",null,null,null,null,null,null,null,null,null,null,null,null,null,null,null,null,null,null,null,null,null,null,null,null,null,null,null,null,null,null,null,null,null,null,null,null,null,null,null,null,null,null,null,null,null,null,null,null,null,"Sensibilizar y divulgar el uso y apropiación de las TI y de la importancia de la seguridad de la información en la entidad"]
[10,{"$f":"IFERROR(VLOOKUP('FORMATO PAI'!F29,Proyecto!$AE$1:$AF$21,2,FALSE),\"\")","v":""},null,null,null,null,null,null,null,null,null,null,null,null,null,null,null,null,null,null,null,null,null,null,null,null,null,null,null,null,"FORTALECIMIENTO DE LAS TECNOLOGÍAS DE LA INFORMACIÓN Y LAS COMUNICACIONES EN EL MINISTERIO DE VIVIENDA, CIUDAD Y TERRITORIO A NIVEL NACIONAL","P_I_10","J"]
[11,{"$f":"IFERROR(VLOOKUP('FORMATO PAI'!F30,Proyecto!$AE$1:$AF$21,2,FALSE),\"\")","v":""},null,null,null,null,null,null,null,null,null,null,null,null,null,null,null,null,null,null,null,null,null,null,null,null,null,null,null,null,"FORTALECIMIENTO DE LA ACTIVIDAD DE MONITOREO A LOS RECURSOS DEL SGP-APSB Y LA ASISTENCIA TÉCNICA DE LAS ENTIDADES TERRITORIALES A NIVEL NACIONAL","P_I_11","K"]
[12,{"$f":"IFERROR(VLOOKUP('FORMATO PAI'!F31,Proyecto!$AE$1:$AF$21,2,FALSE),\"\")","v":""},null,null,null,null,null,null,null,null,null,null,null,null,null,null,null,null,null,null,null,null,null,null,null,null,null,null,null,null,"AMPLIACIÓN Y MEJORAMIENTO DE GESTIÓN INTEGRAL DE RESIDUOS SÓLIDOS EN EL TERRITORIO NACIONAL","P_I_12","L"]
[13,{"$f":"IFERROR(VLOOKUP('FORMATO PAI'!F32,Proyecto!$AE$1:$AF$21,2,FALSE),\"\")","v":""},null,null,null,null,null,null,null,null,null,null,null,null,null,null,null,null,null,null,null,null,null,null,null,null,null,null,null,null,"FORTALECIMIENTO DE LA GESTIÓN JURÍDICA DEL MINISTERIO DE VIVIENDA, CIUDAD Y TERRITORIO A NIVEL NACIONAL","P_I_13","M"]
[14,{"$f":"IFERROR(VLOOKUP('FORMATO PAI'!F33,Proyecto!$AE$1:$AF$21,2,FALSE),\"\")","v":""},null,null,null,null,null,null,null,null,null,null,null,null,null,null,null,null,null,null,null,null,null,null,null,null,null,null,null,null,"APOYO FINANCIERO PARA LA IMPLEMENTACIÓN DEL PLAN MAESTRO DE ALCANTARILLADO DEL MUNICIPIO DE MOCOA","P_I_14","N"]
[15,{"$f":"IFERROR(VLOOKUP('FORMATO PAI'!F34,Proyecto!$AE$1:$AF$21,2,FALSE),\"\")","v":""},null,null,null,null,null,null,null,null,null,null,null,null,null,null,null,null,null,null,null,null,null,null,null,null,null,null,null,null,"Apoyo financiero al plan de inversiones en infraestructura para fortalecer la prestación de los servicios de acueducto y alcantarillado en el municipio de Santiago de Cali","P_I_15","O"]
[16,{"$f":"IFERROR(VLOOKUP('FORMATO PAI'!F35,Proyecto!$AE$1:$AF$21,2,FALSE),\"\")","v":""},null,null,null,null,null,null,null,null,null,null,null,null,null,null,null,null,null,null,null,null,null,null,null,null,null,null,null,null,"Implementación del programa de cobertura condicionada para créditos de vivienda segunda generación Nacional","P_I_16","P"]
[17,{"$f":"IFERROR(VLOOKUP('FORMATO PAI'!F36,Proyecto!$AE$1:$AF$21,2,FALSE),\"\")","v":""},null,null,null,null,null,null,null,null,null,null,null,null,null,null,null,null,null,null,null,null,null,null,null,null,null,null,null,null,"Subsidio Familiar de Vivienda Nacional","P_I_17","Q"]
[18,{"$f":"IFERROR(VLOOKUP('FORMATO PAI'!F37,Proyecto!$AE$1:$AF$21,2,FALSE),\"\")","v":""},null,null,null,null,null,null,null,null,null,null,null,null,null,null,null,null,null,null,null,null,null,null,null,null,null,null,null,null,"Fortalecimiento de los procesos de producción de vivienda Nacional","P_I_18","R"]
[19,{"$f":"IFERROR(VLOOKUP('FORMATO PAI'!F38,Proyecto!$AE$1:$AF$21,2,FALSE),\"\")","v":""},null,null,null,null,null,null,null,null,null,null,null,null,null,null,null,null,null,null,null,null,null,null,null,null,null,null,null,null,"Fortalecimiento a la formulación e implementación de la política de vivienda rural - Nacional","P_I_19","S"]
[20,{"$f":"IFERROR(VLOOKUP('FORMATO PAI'!F39,Proyecto!$AE$1:$AF$21,2,FALSE),\"\")","v":""},null,null,null,null,null,null,null,null,null,null,null,null,null,null,null,null,null,null,null,null,null,null,null,null,null,null,null,null,"Implementación del Programa de agua potable y alcantarillado para el departamento de La Guajira","P_I_20"]
[null,null,null,null,null,null,null,null,null,null,null,null,null,null,null,null,null,null,null,null,null,null,null,null,null,null,null,null,null,null,"Fortalecimiento a la construcción de equipamientos en los programas de vivienda de interés prioritario y social Nacional","P_I_21"]

{"sheet":"PAI-PRELIMINAR","index":13,"n_rows":15,"n_cols":40,"rows_kept":15,"cut":false,"hidden":false,"merged":[[13,11,14,11],[13,26,14,26],[13,27,13,28],[13,33,14,33],[0,4,2,33],[0,0,2,3],[13,3,14,3],[13,4,14,4],[3,0,11,33],[13,1,14,1],[13,2,14,2],[13,0,14,0],[13,25,14,25],[12,0,12,3],[12,4,12,33],[13,5,14,5],[13,6,14,6],[13,7,13,10],[13,12,14,12],[13,13,13,24],[13,29,13,32]]}
[null,null,null,null,"FORMATO: Captura de información para la Planeación Institucional\nPROCESO: Direccionamiento Estratégico",null,null,null,null,null,null,null,null,null,null,null,null,null,null,null,null,null,null,null,null,null,null,null,null,null,null,null,null,null,null,null,null,"Mes","Cantidad de entregables","Cantidad de Entregas"]
[null,null,null,null,null,null,null,null,null,null,null,null,null,null,null,null,null,null,null,null,null,null,null,null,null,null,null,null,null,null,null,null,null,null,null,null,null,"Enero",{"$f":"SUM(N15:N17)","v":0},{"$f":"(COUNTA($N$15:$N$18))-1","v":0}]
[null,null,null,null,null,null,null,null,null,null,null,null,null,null,null,null,null,null,null,null,null,null,null,null,null,null,null,null,null,null,null,null,null,null,null,null,null,"Febrero",null,{"$f":"(COUNTA($O$15:$O$18))-1","v":0}]
[null,null,null,null,null,null,null,null,null,null,null,null,null,null,null,null,null,null,null,null,null,null,null,null,null,null,null,null,null,null,null,null,null,null,null,null,null,"Marzo",null,{"$f":"(COUNTA($P$15:$P$18))-1","v":0}]
[null,null,null,null,null,null,null,null,null,null,null,null,null,null,null,null,null,null,null,null,null,null,null,null,null,null,null,null,null,null,null,null,null,null,null,null,null,"Abril",null,{"$f":"(COUNTA($Q$15:$Q$18))-1","v":0}]
[null,null,null,null,null,null,null,null,null,null,null,null,null,null,null,null,null,null,null,null,null,null,null,null,null,null,null,null,null,null,null,null,null,null,null,null,null,"Mayo",null,{"$f":"(COUNTA($R$15:$R$18))-1","v":0}]
[null,null,null,null,null,null,null,null,null,null,null,null,null,null,null,null,null,null,null,null,null,null,null,null,null,null,null,null,null,null,null,null,null,null,null,null,null,"Junio",null,{"$f":"(COUNTA($S$15:$S$18))-1","v":0}]
[null,null,null,null,null,null,null,null,null,null,null,null,null,null,null,null,null,null,null,null,null,null,null,null,null,null,null,null,null,null,null,null,null,null,null,null,null,"Julio",null,{"$f":"(COUNTA($T$15:$T$18))-1","v":0}]
[null,null,null,null,null,null,null,null,null,null,null,null,null,null,null,null,null,null,null,null,null,null,null,null,null,null,null,null,null,null,null,null,null,null,null,null,null,"Agosto",null,{"$f":"(COUNTA($U$15:$U$18))-1","v":0}]
[null,null,null,null,null,null,null,null,null,null,null,null,null,null,null,null,null,null,null,null,null,null,null,null,null,null,null,null,null,null,null,null,null,null,null,null,null,"Septiembre",null,{"$f":"(COUNTA($V$15:$V$18))-1","v":0}]
[null,null,null,null,null,null,null,null,null,null,null,null,null,null,null,null,null,null,null,null,null,null,null,null,null,null,null,null,null,null,null,null,null,null,null,null,null,"Octubre",null,{"$f":"(COUNTA($W$15:$W$18))-1","v":0}]
[null,null,null,null,null,null,null,null,null,null,null,null,null,null,null,null,null,null,null,null,null,null,null,null,null,null,null,null,null,null,null,null,null,null,null,null,null,"Noviembre",null,{"$f":"(COUNTA($X$15:$X$18))-1","v":0}]
["PLAN ESTRATÉGICO INSTITUCIONAL",null,null,null,"PLAN DE ACCIÓN INSTITUCIONAL ",null,null,null,null,null,null,null,null,null,null,null,null,null,null,null,null,null,null,null,null,null,null,null,null,null,null,null,null,null,null,null,null,"Diciembre",null,{"$f":"(COUNTA($Y$15:$Y$18))-1","v":0}]
["Entidad","Proceso SIG Entidad","Indicador","Dependencia \nResponsable","Meta estratégica","Ponderación de la actividad en la meta estratégica","Actividad","Articulación con los Proyectos de Inversión ",null,null,null,"Entregable","Cantidad\ntotal ","Meses de entrega ",null,null,null,null,null,null,null,null,null,null,null,"Dependencia Responsable","Política del MIPG asociada","Riesgos asociados a la actividad",null,"Articulación con los Planes del Decreto 612 de 2018 ",null,null,null,"¿Es una acción de mejora?"]
[null,null,null,null,null,null,null,"Presupuesto asociado a la actividad","Proyecto de Inversión asociado","Producto","Actividades del Proyecto de Inversión asociado",null,null,"Enero ","Febrero","Marzo ","Abril ","Mayo ","Junio ","Julio ","Agosto ","Septiembre","Octubre","Noviembre","Diciembre",null,null,"Opción 1","Opción 2","Opción 1","Opción 2","Opción 3","Opción 4"]

{"sheet":"FIN","index":14,"n_rows":21,"n_cols":16,"rows_kept":21,"cut":false,"hidden":false,"merged":[[26,2,26,13],[13,2,19,13],[20,8,22,12],[1,1,9,3],[11,1,11,3],[11,4,11,11],[11,12,11,14],[1,4,9,14]]}
[]
[null,"LOGO",null,null,"FORMATO: Captura de información para la Planeación Institucional\nPROCESO: Direccionamiento Estratégico"]
[null,null,null,null,null,null,null,null,null,null,null,null,null,null,null,{"$f":"TODAY()","v":"2023-11-23"}]
[]
[]
[]
[]
[]
[]
[]
[]
[null,"Elija su depencia",null,null,{"$f":"IF(Ele_Dep_MVCT!E12=\"\",\"\",Ele_Dep_MVCT!E12)","v":""},null,null,null,null,null,null,null,{"$f":"MID(E12,1,FIND(\"-\",E12,1)-1)","v":{"$error":"#VALUE!"}}]
[]
[null,null,"Guarde el documento y envíelo a la Oficina Asesora de Planeación. Este formato se diligenció el día:"]
[]
[]
[]
[]
[]
[]
[null,null,null,null,null,null,null,null,{"$f":"IF(P1=\"\",\"\",P1)","v":""}]